BDBM275211 1-[(3S,4S,5S)-1,5-dimethyl- 4-(2-methylphenyl)- pyrrolidin-3-yl]-3-[1-(2- methylpyridin-4-yl)-1H- pyrazolo[3,4-c]pyridin-5- yl)urea::US9884048, Example 105
SMILES C[C@H]1[C@H]([C@@H](CN1C)NC(=O)Nc1cc2cnn(-c3ccnc(C)c3)c2cn1)c1ccccc1C
InChI Key InChIKey=LRIYBBPJQQSPOY-FKRCVWNDSA-N
Data  1 IC50
  Tab Delimited (TSV)   2D SDfile   Computed 3D by Vconf -m prep SDfile
Find this compound or compounds like it in BindingDB:
Activity Spreadsheet -- Enzyme Inhibition Constant Data from BindingDB
Found 1 hit for monomerid = 275211
TargetMitogen-activated protein kinase 1(Homo sapiens (Human))
Merck Sharp & Dohme
US Patent
LigandPNGBDBM275211(1-[(3S,4S,5S)-1,5-dimethyl- 4-(2-methylphenyl)- py...)
Affinity DataIC50:  2.15nM. Assay description: Activated ERK2 activity was determined in an IMAP-FP assay (Molecular Devices). Using this assay format, the potency (IC50) of each compound was dete...
Ligand InfoPC cidPC sid
In DepthDetails US Patent