BDBM275404 1-[(3R)-1-(2,6- difluorobenzyl)pyrrolidin-3- yl]-3-[1-(2-methylpyridin-4- yl)-1H-pyrazolo[3,4-c]pyridin- 5-yl]urea::US9884048, Example 283
SMILES Cc1cc(ccn1)-n1ncc2cc(NC(=O)N[C@@H]3CCN(Cc4c(F)cccc4F)C3)ncc12
InChI Key InChIKey=JHKZVUGZPXSLMU-QGZVFWFLSA-N
Data  1 IC50
  Tab Delimited (TSV)   2D SDfile   Computed 3D by Vconf -m prep SDfile
Find this compound or compounds like it in BindingDB:
Activity Spreadsheet -- Enzyme Inhibition Constant Data from BindingDB
Found 1 hit for monomerid = 275404
TargetMitogen-activated protein kinase 1(Homo sapiens (Human))
Merck Sharp & Dohme
US Patent
LigandPNGBDBM275404(1-[(3R)-1-(2,6- difluorobenzyl)pyrrolidin-3- yl]-3...)
Affinity DataIC50:  0.320nM. Assay description: Activated ERK2 activity was determined in an IMAP-FP assay (Molecular Devices). Using this assay format, the potency (IC50) of each compound was dete...
Ligand InfoPC cidPC sid
In DepthDetails US Patent