BDBM275624 US9884814, Compound 229
SMILES COc1ccc(CC(=O)NC(=N)N[C@H](CC2CCCCC2)C(=O)NCC(C)C)c(Br)c1
InChI Key InChIKey=IXRDVBWPQLYCFB-HXUWFJFHSA-N
Data  1 IC50
  Tab Delimited (TSV)   2D SDfile   Computed 3D by Vconf -m prep SDfile
Find this compound or compounds like it in BindingDB:
Activity Spreadsheet -- Enzyme Inhibition Constant Data from BindingDB
Found 1 hit for monomerid = 275624
TargetCathepsin D(Homo sapiens (Human))
Merck Patent
US Patent
LigandPNGBDBM275624(US9884814, Compound 229)
Affinity DataIC50:  43nMpH: 5.5 T: 2°C. Assay description: In order to identify modulators of cathepsin D activity, a continuous enzymatic test was carried out with a synthetic peptide which carries a fluores...
Ligand InfoPC cidPC sid
In DepthDetails US Patent