BDBM275741 US10071086, Compound 647
SMILES CC(C)(C)CC(=O)Nc1cncc(c1)-c1cnc2[nH]nc(-c3nc4c(cccc4[nH]3)-c3ccncc3)c2c1
InChI Key InChIKey=CDOGGPPOYREPAO-UHFFFAOYSA-N
Data  1 IC50
  Tab Delimited (TSV)   2D SDfile   Computed 3D by Vconf -m prep SDfile
Find this compound or compounds like it in BindingDB:
Activity Spreadsheet -- Enzyme Inhibition Constant Data from BindingDB
Found 1 hit for monomerid = 275741
TargetAdenomatous polyposis coli protein(Homo sapiens (Human))
Samumed
US Patent
LigandPNGBDBM275741(US10071086, Compound 647)
Affinity DataIC50:  1.52E+3nM. Assay description: Reporter cell lines can be generated by stably transducing cells of cancer cell lines (e.g., colon cancer) with a lentiviral construct that include a...
Ligand InfoPC cidPC sid
In DepthDetails US Patent