BDBM275819 5-chloro-4-((5-chloro- 6-(2,2,3,3-tetrafluoro- propoxy)pyridin-3- yl)oxy)-2-fluoro-N- sulfamoylbenzamide::US10071957, Example 37
SMILES NS(=O)(=O)NC(=O)c1cc(Cl)c(Oc2cnc(OCC(F)(F)C(F)F)c(Cl)c2)cc1F
InChI Key InChIKey=SONLXYKIKJCQNM-UHFFFAOYSA-N
Data  1 IC50
  Tab Delimited (TSV)   2D SDfile   Computed 3D by Vconf -m prep SDfile
Find this compound or compounds like it in BindingDB:
Activity Spreadsheet -- Enzyme Inhibition Constant Data from BindingDB
Found 1 hit for monomerid = 275819
TargetSodium channel protein type 9 subunit alpha(Homo sapiens (Human))
Genentech
US Patent
LigandPNGBDBM275819(5-chloro-4-((5-chloro- 6-(2,2,3,3-tetrafluoro- pro...)
Affinity DataIC50:  171nMpH: 7.4 T: 2°C. Assay description: Preparation of membranes containing recombinantly expressed sodium channels: Frozen recombinant cell pellets were thawed on ice and diluted to 4 time...
Ligand InfoPC cidPC sid
In DepthDetails US Patent