BDBM275826 5-chloro-N-(N,N- dimethylsulfamoyl)- 2-fluoro-4-(4-(thiazol- 2-yl)phenoxy) benzamide::US10071957, Example 44
SMILES CN(C)S(=O)(=O)NC(=O)c1cc(Cl)c(Oc2ccc(cc2)-c2nccs2)cc1F
InChI Key InChIKey=JZNDZBXHKLJAPA-UHFFFAOYSA-N
Data  1 IC50
  Tab Delimited (TSV)   2D SDfile   Computed 3D by Vconf -m prep SDfile
Find this compound or compounds like it in BindingDB:
Activity Spreadsheet -- Enzyme Inhibition Constant Data from BindingDB
Found 1 hit for monomerid = 275826
TargetSodium channel protein type 9 subunit alpha(Homo sapiens (Human))
Genentech
US Patent
LigandPNGBDBM275826(5-chloro-N-(N,N- dimethylsulfamoyl)- 2-fluoro-4-(4...)
Affinity DataIC50:  869nMpH: 7.4 T: 2°C. Assay description: Preparation of membranes containing recombinantly expressed sodium channels: Frozen recombinant cell pellets were thawed on ice and diluted to 4 time...
Ligand InfoPC cidPC sid
In DepthDetails US Patent