BDBM275828 N-(azetidin-1- ylsulfonyl)-5-chloro- 4-((5-chloro-6-iso- butoxypyridin-3- yl)oxy)-2- fluorobenzamide::US10071957, Example 46
SMILES CC(C)COc1ncc(Oc2cc(F)c(cc2Cl)C(=O)NS(=O)(=O)N2CCC2)cc1Cl
InChI Key InChIKey=FJDOVVBUORUIFD-UHFFFAOYSA-N
Data  1 IC50
  Tab Delimited (TSV)   2D SDfile   Computed 3D by Vconf -m prep SDfile
Find this compound or compounds like it in BindingDB:
Activity Spreadsheet -- Enzyme Inhibition Constant Data from BindingDB
Found 1 hit for monomerid = 275828
TargetSodium channel protein type 9 subunit alpha(Homo sapiens (Human))
Genentech
US Patent
LigandPNGBDBM275828(N-(azetidin-1- ylsulfonyl)-5-chloro- 4-((5-chloro-...)
Affinity DataIC50:  9.20nMpH: 7.4 T: 2°C. Assay description: Preparation of membranes containing recombinantly expressed sodium channels: Frozen recombinant cell pellets were thawed on ice and diluted to 4 time...
Ligand InfoPC cidPC sid
In DepthDetails US Patent