BDBM275830 5-chloro-2-fluoro-4- (naphthalen-2-yloxy)- N-sulfamoyl- benzamide::US10071957, Example 48
SMILES NS(=O)(=O)NC(=O)c1cc(Cl)c(Oc2ccc3ccccc3c2)cc1F
InChI Key InChIKey=QDSBWEOXPUGESA-UHFFFAOYSA-N
Data  1 IC50
  Tab Delimited (TSV)   2D SDfile   Computed 3D by Vconf -m prep SDfile
Find this compound or compounds like it in BindingDB:
Activity Spreadsheet -- Enzyme Inhibition Constant Data from BindingDB
Found 1 hit for monomerid = 275830
TargetSodium channel protein type 9 subunit alpha(Homo sapiens (Human))
Genentech
US Patent
LigandPNGBDBM275830(5-chloro-2-fluoro-4- (naphthalen-2-yloxy)- N-sulfa...)
Affinity DataIC50:  138nMpH: 7.4 T: 2°C. Assay description: Preparation of membranes containing recombinantly expressed sodium channels: Frozen recombinant cell pellets were thawed on ice and diluted to 4 time...
Ligand InfoPC cidPC sid
In DepthDetails US Patent