BDBM275864 US10071957, Example 83
SMILES CNS(=O)(=O)NC(=O)c1ccc(Oc2cnc(OC(C)C)c(Cl)c2)c(c1)-c1cccnc1OC
InChI Key InChIKey=IOHMBULHSBRPNR-UHFFFAOYSA-N
Data  1 IC50
  Tab Delimited (TSV)   2D SDfile   Computed 3D by Vconf -m prep SDfile
Find this compound or compounds like it in BindingDB:
Activity Spreadsheet -- Enzyme Inhibition Constant Data from BindingDB
Found 1 hit for monomerid = 275864
TargetSodium channel protein type 9 subunit alpha(Homo sapiens (Human))
Genentech
US Patent
LigandPNGBDBM275864(US10071957, Example 83)
Affinity DataIC50:  43nMpH: 7.4 T: 2°C. Assay description: Preparation of membranes containing recombinantly expressed sodium channels: Frozen recombinant cell pellets were thawed on ice and diluted to 4 time...
Ligand InfoPC cidPC sid
In DepthDetails US Patent