BDBM275987 US10071974, Example 98
SMILES CC(C)(NC(=O)[C@@H]1CNCCO1)c1ncc2c(F)cccn12
InChI Key InChIKey=MXMGMNYELCTSPJ-LBPRGKRZSA-N
Data  1 EC50
  Tab Delimited (TSV)   2D SDfile   Computed 3D by Vconf -m prep SDfile
Find this compound or compounds like it in BindingDB:
Activity Spreadsheet -- Enzyme Inhibition Constant Data from BindingDB
Found 1 hit for monomerid = 275987
TargetSomatostatin receptor type 4(Homo sapiens (Human))
Boehringer Ingelheim International
US Patent
LigandPNGBDBM275987(US10071974, Example 98)
Affinity DataEC50:  85.3nMpH: 7.4 T: 2°C. Assay description: Compounds are dissolved and diluted in DMSO. The final test solution contains 1% DMSO. The cAMP standard (Lance cAMP 384 Kit; PerkinElmer, Cat# AD026...
Ligand InfoPC cidPC sid
In DepthDetails US Patent