BDBM27643 1-(5-{[(2S)-2-aminopropanamido]methyl}thiophen-2-yl)-N-[(2-methoxyphenyl)methyl]-3-(trifluoromethyl)-1H-pyrazole-5-carboxamide::pyrazole scaffold, 10a
SMILES COc1ccccc1CNC(=O)c1cc(nn1-c1ccc(CNC(=O)[C@H](C)N)s1)C(F)(F)F
InChI Key InChIKey=HAIVUPRJVLMSPN-LBPRGKRZSA-N
Data  1 IC50
  Tab Delimited (TSV)   2D SDfile   Computed 3D by Vconf -m prep SDfile
Find this compound or compounds like it in BindingDB:
Activity Spreadsheet -- Enzyme Inhibition Constant Data from BindingDB
Found 1 hit for monomerid = 27643
TargetHistone-arginine methyltransferase CARM1(Mus musculus (mouse))
Methylgene
LigandPNGBDBM27643(1-(5-{[(2S)-2-aminopropanamido]methyl}thiophen-2-y...)
Affinity DataIC50:  300nMpH: 9.0 T: 2°C. Assay description: Histone H3 is used as the substrate for CARM-1 enzyme, and the methylation is monitored using tritiated S-Adenosyl-Methionine (SAM) as a methyl donor...
In DepthDetails ArticlePubMed