BDBM276760 US10071992, Example 6a
SMILES CCOc1cccnc1Oc1cncc(c1)-c1ncc(cn1)C(=O)NC1(CO)CCOC1
InChI Key InChIKey=DFNKRIPGDXQUEM-UHFFFAOYSA-N
Data  3 IC50
  Tab Delimited (TSV)   2D SDfile   Computed 3D by Vconf -m prep SDfile
Find this compound or compounds like it in BindingDB:
Activity Spreadsheet -- Enzyme Inhibition Constant Data from BindingDB
Found 3 hits for monomerid = 276760
TargetDiacylglycerol O-acyltransferase 2(Homo sapiens (Human))
Pfizer
US Patent
LigandPNGBDBM276760(US10071992, Example 6a)
Affinity DataIC50:  20.9nMpH: 7.4 T: 2°C. Assay description: For determination of IC50 values, the reactions were carried out in 384-well white Polyplates (Perkin Elmer) in a total volume of 20 μL. To 1 &#...
Ligand InfoPC cidPC sid
In DepthDetails US Patent
TargetDiacylglycerol O-acyltransferase 2(Homo sapiens (Human))
Pfizer
US Patent
LigandPNGBDBM276760(US10071992, Example 6a)
Affinity DataIC50:  29.5nM. Assay description: Inhibition of human DGAT2 expressed in Sf9 insect cell membrane using [1-14C]decanoyl-CoA and 1,2-didecanoyl-sn-glycerol as substrates assessed as in...
Ligand InfoPC cidPC sid
In DepthDetails PubMed
TargetDiacylglycerol O-acyltransferase 2(Homo sapiens (Human))
Pfizer
US Patent
LigandPNGBDBM276760(US10071992, Example 6a)
Affinity DataIC50:  30nM. Assay description: Inhibition of human DGAT2 expressed in Sf9 insect cell membrane using [1-14C]decanoyl-CoA and 1,2-didecanoyl-sn-glycerol as substrates assessed as in...
Ligand InfoPC cidPC sid
In DepthDetails PubMed