BDBM277230 US10072005, Example 23
SMILES O[C@H]1CCCC[C@@H]1NC(=O)c1cn(Cc2ccc(Cl)cc2)c2cccnc12
InChI Key InChIKey=BWCHBGSWYPSGEG-HKUYNNGSSA-N
Data  1 EC50
  Tab Delimited (TSV)   2D SDfile   Computed 3D by Vconf -m prep SDfile
Find this compound or compounds like it in BindingDB:
Activity Spreadsheet -- Enzyme Inhibition Constant Data from BindingDB
Found 1 hit for monomerid = 277230
TargetMuscarinic acetylcholine receptor M1(Homo sapiens (Human))
Eisai R&D Management
US Patent
LigandPNGBDBM277230(US10072005, Example 23)
Affinity DataEC50:  251nMT: 2°C. Assay description: Following agonist data acquisition, cells were then incubated for a further 30 min at room temperature before either an EC20 concentration (to measur...
Ligand InfoPC cidPC sid
In DepthDetails US Patent