BDBM277269 US10072005, Example 62
SMILES Cc1ccc(Cn2cc(C(=O)N[C@H]3CCCC[C@@H]3O)c3nccc(Cl)c23)cn1
InChI Key InChIKey=KIJSJJQYSJOHJY-ROUUACIJSA-N
Data  1 EC50
  Tab Delimited (TSV)   2D SDfile   Computed 3D by Vconf -m prep SDfile
Find this compound or compounds like it in BindingDB:
Activity Spreadsheet -- Enzyme Inhibition Constant Data from BindingDB
Found 1 hit for monomerid = 277269
TargetMuscarinic acetylcholine receptor M1(Homo sapiens (Human))
Eisai R&D Management
US Patent
LigandPNGBDBM277269(US10072005, Example 62)
Affinity DataEC50:  39.8nMT: 2°C. Assay description: Following agonist data acquisition, cells were then incubated for a further 30 min at room temperature before either an EC20 concentration (to measur...
Ligand InfoPC cidPC sid
In DepthDetails US Patent