BDBM277273 US10072005, Example 66
SMILES COc1ccc(Cn2cc(C(=O)N[C@H]3CCCC[C@@H]3O)c3nccc(C)c23)cc1C
InChI Key InChIKey=FRGHQJCMHJUKJD-PMACEKPBSA-N
Data  1 EC50
  Tab Delimited (TSV)   2D SDfile   Computed 3D by Vconf -m prep SDfile
Find this compound or compounds like it in BindingDB:
Activity Spreadsheet -- Enzyme Inhibition Constant Data from BindingDB
Found 1 hit for monomerid = 277273
TargetMuscarinic acetylcholine receptor M1(Homo sapiens (Human))
Eisai R&D Management
US Patent
LigandPNGBDBM277273(US10072005, Example 66)
Affinity DataEC50:  12.6nMT: 2°C. Assay description: Following agonist data acquisition, cells were then incubated for a further 30 min at room temperature before either an EC20 concentration (to measur...
Ligand InfoPC cidPC sid
In DepthDetails US Patent