BDBM277282 US10072005, Example 75
SMILES Cc1cnc(Cn2cc(C(=O)N[C@H]3CCCC[C@@H]3O)c3nccc(Cl)c23)s1
InChI Key InChIKey=IJWOHXKCYOHEIZ-GJZGRUSLSA-N
Data  1 EC50
  Tab Delimited (TSV)   2D SDfile   Computed 3D by Vconf -m prep SDfile
Find this compound or compounds like it in BindingDB:
Activity Spreadsheet -- Enzyme Inhibition Constant Data from BindingDB
Found 1 hit for monomerid = 277282
TargetMuscarinic acetylcholine receptor M1(Homo sapiens (Human))
Eisai R&D Management
US Patent
LigandPNGBDBM277282(US10072005, Example 75)
Affinity DataEC50:  251nMT: 2°C. Assay description: Following agonist data acquisition, cells were then incubated for a further 30 min at room temperature before either an EC20 concentration (to measur...
Ligand InfoPC cidPC sid
In DepthDetails US Patent