BDBM277300 US10072005, Example 93
SMILES COc1ccc(Cn2cc(C(=O)N[C@H]3CCCC[C@@H]3O)c3ncccc23)cc1
InChI Key InChIKey=KQYFNYPILBBWOB-ICSRJNTNSA-N
Data  2 EC50
  Tab Delimited (TSV)   2D SDfile   Computed 3D by Vconf -m prep SDfile
Find this compound or compounds like it in BindingDB:
Activity Spreadsheet -- Enzyme Inhibition Constant Data from BindingDB
Found 2 hits for monomerid = 277300
TargetMuscarinic acetylcholine receptor M1(Homo sapiens (Human))
TBA
Curated by ChEMBL
LigandPNGBDBM277300(US10072005, Example 93)
Affinity DataEC50:  1.80E+3nM. Assay description: Positive allosteric modulation of M1 AchR (unknown origin)
Ligand InfoPC cidPC sid
In DepthDetails ArticlePubMed
TargetMuscarinic acetylcholine receptor M1(Homo sapiens (Human))
TBA
Curated by ChEMBL
LigandPNGBDBM277300(US10072005, Example 93)
Affinity DataEC50:  126nMT: 2°C. Assay description: Following agonist data acquisition, cells were then incubated for a further 30 min at room temperature before either an EC20 concentration (to measur...
Ligand InfoPC cidPC sid
In DepthDetails US Patent