BDBM277323 US10072025, Example 2-1::tert-butyl 4-(3-((4-(8-oxa-3-azabicyclo[3.2.1]octane-3-carbonyl)-3-methylphenyl)amino)-4-oxo-4,5-dihydro-1H-pyrazolo[4,3-c]pyridin-1-yl)-4-ethylpiperidine-1-carboxylate
SMILES CCC1(CCN(CC1)C(=O)OC(C)(C)C)n1nc(Nc2ccc(C(=O)N3CC4CCC(C3)O4)c(C)c2)c2c1cc[nH]c2=O
InChI Key InChIKey=XTOJHQAKCRPBFI-UHFFFAOYSA-N
Data  2 IC50
  Tab Delimited (TSV)   2D SDfile   Computed 3D by Vconf -m prep SDfile
Find this compound or compounds like it in BindingDB:
Activity Spreadsheet -- Enzyme Inhibition Constant Data from BindingDB
Found 2 hits for monomerid = 277323
TargetTyrosine-protein kinase JAK2(Homo sapiens (Human))
Merck Sharp & Dohme
US Patent
LigandPNGBDBM277323(US10072025, Example 2-1 | tert-butyl 4-(3-((4-(8-o...)
Affinity DataIC50:  0.490nM
Ligand InfoPC cidPC sid
In DepthDetails US Patent
TargetTyrosine-protein kinase JAK1(Homo sapiens (Human))
Merck Sharp & Dohme
US Patent
LigandPNGBDBM277323(US10072025, Example 2-1 | tert-butyl 4-(3-((4-(8-o...)
Affinity DataIC50:  0.470nMT: 2°C. Assay description: The ability of compounds to inhibit the activity of JAK1, JAK2, JAK3, and Tyk2 was measured using a recombinant purified GST-tagged catalytic domain ...
Ligand InfoPC cidPC sid
In DepthDetails US Patent