BDBM277403 N5-((1R,3s,5S)-9-((5-fluoropyridin-3-yl)sulfonyl)-9-azabicyclo[3.3.1]nonan-3-yl)-N7-(5-methyl-1H-pyrazol-3-yl)-1,6-naphthyridine-5,7-diamine::US10072026, Example 14::US10947254, Example 14::US11780852, Example 14
SMILES Cc1cc(Nc2cc3ncccc3c(N[C@H]3C[C@@H]4CCC[C@H](C3)N4S(=O)(=O)c3cncc(F)c3)n2)n[nH]1
InChI Key
Data  12 KI
  Tab Delimited (TSV)   2D SDfile   Computed 3D by Vconf -m prep SDfile
Find this compound or compounds like it in BindingDB:
Activity Spreadsheet -- Enzyme Inhibition Constant Data from BindingDB
Found 12 hits for monomerid = 277403
TargetTyrosine-protein kinase JAK1(Homo sapiens (Human))
Theravance Biopharma R&D Ip
US Patent
LigandPNGBDBM277403(N5-((1R,3s,5S)-9-((5-fluoropyridin-3-yl)sulfonyl)-...)
Affinity DataKi: <0.100nMpH: 7.5Assay Description:A panel of four LanthaScreen JAK biochemical assays (JAK1, 2, 3 and Tyk2) were carried in a common kinase reaction buffer (50 mM HEPES, pH 7.5, 0.01%...
Ligand InfoPC cidPC sid
In DepthDetails US Patent
TargetTyrosine-protein kinase JAK2(Homo sapiens (Human))
Theravance Biopharma R&D Ip
US Patent
LigandPNGBDBM277403(N5-((1R,3s,5S)-9-((5-fluoropyridin-3-yl)sulfonyl)-...)
Affinity DataKi: <0.100nMpH: 7.5Assay Description:A panel of four LanthaScreen JAK biochemical assays (JAK1, 2, 3 and Tyk2) were carried in a common kinase reaction buffer (50 mM HEPES, pH 7.5, 0.01%...
Ligand InfoPC cidPC sid
In DepthDetails US Patent
TargetTyrosine-protein kinase JAK2(Homo sapiens (Human))
Theravance Biopharma R&D Ip
US Patent
LigandPNGBDBM277403(N5-((1R,3s,5S)-9-((5-fluoropyridin-3-yl)sulfonyl)-...)
Affinity DataKi: <0.100nM. Assay description: A panel of four LanthaScreen JAK biochemical assays (JAK1, 2, 3 and Tyk2) were carried in a common kinase reaction buffer (50 mM HEPES, pH 7.5, 0.01%...
Ligand InfoPC cidPC sid
In DepthDetails US Patent
TargetTyrosine-protein kinase JAK2(Homo sapiens (Human))
Theravance Biopharma R&D Ip
US Patent
LigandPNGBDBM277403(N5-((1R,3s,5S)-9-((5-fluoropyridin-3-yl)sulfonyl)-...)
Affinity DataKi: <0.100nM. Assay description: Biochemical JAK and Off-Target Kinase Assays. A panel of four LanthaScreen JAK biochemical assays (JAK1, 2, 3 and Tyk2) were carried in a common kin...
Ligand InfoPC cidPC sid
In DepthDetails US Patent
TargetTyrosine-protein kinase JAK1(Homo sapiens (Human))
Theravance Biopharma R&D Ip
US Patent
LigandPNGBDBM277403(N5-((1R,3s,5S)-9-((5-fluoropyridin-3-yl)sulfonyl)-...)
Affinity DataKi: <0.100nM. Assay description: Biochemical JAK and Off-Target Kinase Assays. A panel of four LanthaScreen JAK biochemical assays (JAK1, 2, 3 and Tyk2) were carried in a common kin...
Ligand InfoPC cidPC sid
In DepthDetails US Patent
TargetTyrosine-protein kinase JAK1(Homo sapiens (Human))
Theravance Biopharma R&D Ip
US Patent
LigandPNGBDBM277403(N5-((1R,3s,5S)-9-((5-fluoropyridin-3-yl)sulfonyl)-...)
Affinity DataKi: <0.100nM. Assay description: A panel of four LanthaScreen JAK biochemical assays (JAK1, 2, 3 and Tyk2) were carried in a common kinase reaction buffer (50 mM HEPES, pH 7.5, 0.01%...
Ligand InfoPC cidPC sid
In DepthDetails US Patent
TargetNon-receptor tyrosine-protein kinase TYK2(Homo sapiens (Human))
Theravance Biopharma R&D Ip
US Patent
LigandPNGBDBM277403(N5-((1R,3s,5S)-9-((5-fluoropyridin-3-yl)sulfonyl)-...)
Affinity DataKi:  0.550nM. Assay description: A panel of four LanthaScreen JAK biochemical assays (JAK1, 2, 3 and Tyk2) were carried in a common kinase reaction buffer (50 mM HEPES, pH 7.5, 0.01%...
Ligand InfoPC cidPC sid
In DepthDetails US Patent
TargetNon-receptor tyrosine-protein kinase TYK2(Homo sapiens (Human))
Theravance Biopharma R&D Ip
US Patent
LigandPNGBDBM277403(N5-((1R,3s,5S)-9-((5-fluoropyridin-3-yl)sulfonyl)-...)
Affinity DataKi:  0.550nM. Assay description: Biochemical JAK and Off-Target Kinase Assays. A panel of four LanthaScreen JAK biochemical assays (JAK1, 2, 3 and Tyk2) were carried in a common kin...
Ligand InfoPC cidPC sid
In DepthDetails US Patent
TargetNon-receptor tyrosine-protein kinase TYK2(Homo sapiens (Human))
Theravance Biopharma R&D Ip
US Patent
LigandPNGBDBM277403(N5-((1R,3s,5S)-9-((5-fluoropyridin-3-yl)sulfonyl)-...)
Affinity DataKi:  0.550nMpH: 7.5Assay Description:A panel of four LanthaScreen JAK biochemical assays (JAK1, 2, 3 and Tyk2) were carried in a common kinase reaction buffer (50 mM HEPES, pH 7.5, 0.01%...
Ligand InfoPC cidPC sid
In DepthDetails US Patent
TargetTyrosine-protein kinase JAK3(Homo sapiens (Human))
Theravance Biopharma R&D Ip
US Patent
LigandPNGBDBM277403(N5-((1R,3s,5S)-9-((5-fluoropyridin-3-yl)sulfonyl)-...)
Affinity DataKi:  50nM. Assay description: A panel of four LanthaScreen JAK biochemical assays (JAK1, 2, 3 and Tyk2) were carried in a common kinase reaction buffer (50 mM HEPES, pH 7.5, 0.01%...
Ligand InfoPC cidPC sid
In DepthDetails US Patent
TargetTyrosine-protein kinase JAK3(Homo sapiens (Human))
Theravance Biopharma R&D Ip
US Patent
LigandPNGBDBM277403(N5-((1R,3s,5S)-9-((5-fluoropyridin-3-yl)sulfonyl)-...)
Affinity DataKi:  50nMpH: 7.5Assay Description:A panel of four LanthaScreen JAK biochemical assays (JAK1, 2, 3 and Tyk2) were carried in a common kinase reaction buffer (50 mM HEPES, pH 7.5, 0.01%...
Ligand InfoPC cidPC sid
In DepthDetails US Patent
TargetTyrosine-protein kinase JAK3(Homo sapiens (Human))
Theravance Biopharma R&D Ip
US Patent
LigandPNGBDBM277403(N5-((1R,3s,5S)-9-((5-fluoropyridin-3-yl)sulfonyl)-...)
Affinity DataKi:  50.5nM. Assay description: Biochemical JAK and Off-Target Kinase Assays. A panel of four LanthaScreen JAK biochemical assays (JAK1, 2, 3 and Tyk2) were carried in a common kin...
Ligand InfoPC cidPC sid
In DepthDetails US Patent