BDBM27742 (2S,3R)-3-(tert-butoxy)-2-[(2-{[(2,6-dimethyl-4-propylphenyl)carbamoyl]amino}-4-fluorophenyl)formamido]butanoic acid::anthranilimide based compound, 18
SMILES CCCc1cc(C)c(NC(=O)Nc2cc(F)ccc2C(=O)N[C@@H]([C@@H](C)OC(C)(C)C)C(O)=O)c(C)c1
InChI Key InChIKey=FTQJMBQDIJNIAP-HXOBKFHXSA-N
Data  1 IC50
  Tab Delimited (TSV)   2D SDfile   Computed 3D by Vconf -m prep SDfile
Find this compound or compounds like it in BindingDB:
Activity Spreadsheet -- Enzyme Inhibition Constant Data from BindingDB
Found 1 hit for monomerid = 27742
TargetGlycogen phosphorylase, liver form(Homo sapiens (Human))
Gsk
LigandPNGBDBM27742((2S,3R)-3-(tert-butoxy)-2-[(2-{[(2,6-dimethyl-4-pr...)
Affinity DataIC50:  10nMpH: 7.6 T: 2°C. Assay description: An enzymatic assay was developed to measure the response of the activated form of glycogen phosphorylase to small molecule compounds. The assay was t...
In DepthDetails ArticlePubMed