BDBM277556 US10072026, Example 5-18::US10947254, Example 5-18::US11780852, Example 5-18
SMILES Cc1cc(Nc2cc3nc(CN4CCOCC4)ccc3c(N[C@H]3C[C@@H]4CC[C@H](C3)N4CCC#N)n2)n[nH]1
InChI Key
Data  12 KI
  Tab Delimited (TSV)   2D SDfile   Computed 3D by Vconf -m prep SDfile
Find this compound or compounds like it in BindingDB:
Activity Spreadsheet -- Enzyme Inhibition Constant Data from BindingDB
Found 12 hits for monomerid = 277556
TargetTyrosine-protein kinase JAK2(Homo sapiens (Human))
Theravance Biopharma R&D Ip
US Patent
LigandPNGBDBM277556(US10072026, Example 5-18 | US10947254, Example 5-1...)
Affinity DataKi: <0.100nM. Assay description: A panel of four LanthaScreen JAK biochemical assays (JAK1, 2, 3 and Tyk2) were carried in a common kinase reaction buffer (50 mM HEPES, pH 7.5, 0.01%...
Ligand InfoPC cidPC sid
In DepthDetails US Patent
TargetTyrosine-protein kinase JAK2(Homo sapiens (Human))
Theravance Biopharma R&D Ip
US Patent
LigandPNGBDBM277556(US10072026, Example 5-18 | US10947254, Example 5-1...)
Affinity DataKi: <0.100nM. Assay description: Biochemical JAK and Off-Target Kinase Assays. A panel of four LanthaScreen JAK biochemical assays (JAK1, 2, 3 and Tyk2) were carried in a common kin...
Ligand InfoPC cidPC sid
In DepthDetails US Patent
TargetTyrosine-protein kinase JAK2(Homo sapiens (Human))
Theravance Biopharma R&D Ip
US Patent
LigandPNGBDBM277556(US10072026, Example 5-18 | US10947254, Example 5-1...)
Affinity DataKi: <0.100nMpH: 7.5Assay Description:A panel of four LanthaScreen JAK biochemical assays (JAK1, 2, 3 and Tyk2) were carried in a common kinase reaction buffer (50 mM HEPES, pH 7.5, 0.01%...
Ligand InfoPC cidPC sid
In DepthDetails US Patent
TargetNon-receptor tyrosine-protein kinase TYK2(Homo sapiens (Human))
Theravance Biopharma R&D Ip
US Patent
LigandPNGBDBM277556(US10072026, Example 5-18 | US10947254, Example 5-1...)
Affinity DataKi:  0.550nMpH: 7.5Assay Description:A panel of four LanthaScreen JAK biochemical assays (JAK1, 2, 3 and Tyk2) were carried in a common kinase reaction buffer (50 mM HEPES, pH 7.5, 0.01%...
Ligand InfoPC cidPC sid
In DepthDetails US Patent
TargetTyrosine-protein kinase JAK1(Homo sapiens (Human))
Theravance Biopharma R&D Ip
US Patent
LigandPNGBDBM277556(US10072026, Example 5-18 | US10947254, Example 5-1...)
Affinity DataKi:  0.550nM. Assay description: A panel of four LanthaScreen JAK biochemical assays (JAK1, 2, 3 and Tyk2) were carried in a common kinase reaction buffer (50 mM HEPES, pH 7.5, 0.01%...
Ligand InfoPC cidPC sid
In DepthDetails US Patent
TargetNon-receptor tyrosine-protein kinase TYK2(Homo sapiens (Human))
Theravance Biopharma R&D Ip
US Patent
LigandPNGBDBM277556(US10072026, Example 5-18 | US10947254, Example 5-1...)
Affinity DataKi:  0.550nM. Assay description: Biochemical JAK and Off-Target Kinase Assays. A panel of four LanthaScreen JAK biochemical assays (JAK1, 2, 3 and Tyk2) were carried in a common kin...
Ligand InfoPC cidPC sid
In DepthDetails US Patent
TargetTyrosine-protein kinase JAK3(Homo sapiens (Human))
Theravance Biopharma R&D Ip
US Patent
LigandPNGBDBM277556(US10072026, Example 5-18 | US10947254, Example 5-1...)
Affinity DataKi:  0.550nM. Assay description: A panel of four LanthaScreen JAK biochemical assays (JAK1, 2, 3 and Tyk2) were carried in a common kinase reaction buffer (50 mM HEPES, pH 7.5, 0.01%...
Ligand InfoPC cidPC sid
In DepthDetails US Patent
TargetTyrosine-protein kinase JAK1(Homo sapiens (Human))
Theravance Biopharma R&D Ip
US Patent
LigandPNGBDBM277556(US10072026, Example 5-18 | US10947254, Example 5-1...)
Affinity DataKi:  0.550nMpH: 7.5Assay Description:A panel of four LanthaScreen JAK biochemical assays (JAK1, 2, 3 and Tyk2) were carried in a common kinase reaction buffer (50 mM HEPES, pH 7.5, 0.01%...
Ligand InfoPC cidPC sid
In DepthDetails US Patent
TargetTyrosine-protein kinase JAK1(Homo sapiens (Human))
Theravance Biopharma R&D Ip
US Patent
LigandPNGBDBM277556(US10072026, Example 5-18 | US10947254, Example 5-1...)
Affinity DataKi:  0.550nM. Assay description: Biochemical JAK and Off-Target Kinase Assays. A panel of four LanthaScreen JAK biochemical assays (JAK1, 2, 3 and Tyk2) were carried in a common kin...
Ligand InfoPC cidPC sid
In DepthDetails US Patent
TargetTyrosine-protein kinase JAK3(Homo sapiens (Human))
Theravance Biopharma R&D Ip
US Patent
LigandPNGBDBM277556(US10072026, Example 5-18 | US10947254, Example 5-1...)
Affinity DataKi:  0.550nMpH: 7.5Assay Description:A panel of four LanthaScreen JAK biochemical assays (JAK1, 2, 3 and Tyk2) were carried in a common kinase reaction buffer (50 mM HEPES, pH 7.5, 0.01%...
Ligand InfoPC cidPC sid
In DepthDetails US Patent
TargetTyrosine-protein kinase JAK3(Homo sapiens (Human))
Theravance Biopharma R&D Ip
US Patent
LigandPNGBDBM277556(US10072026, Example 5-18 | US10947254, Example 5-1...)
Affinity DataKi:  0.550nM. Assay description: Biochemical JAK and Off-Target Kinase Assays. A panel of four LanthaScreen JAK biochemical assays (JAK1, 2, 3 and Tyk2) were carried in a common kin...
Ligand InfoPC cidPC sid
In DepthDetails US Patent
TargetNon-receptor tyrosine-protein kinase TYK2(Homo sapiens (Human))
Theravance Biopharma R&D Ip
US Patent
LigandPNGBDBM277556(US10072026, Example 5-18 | US10947254, Example 5-1...)
Affinity DataKi:  0.550nM. Assay description: A panel of four LanthaScreen JAK biochemical assays (JAK1, 2, 3 and Tyk2) were carried in a common kinase reaction buffer (50 mM HEPES, pH 7.5, 0.01%...
Ligand InfoPC cidPC sid
In DepthDetails US Patent