BDBM277762 3-{[5-chloro-1-(3,3,3-trifluoropropyl)-1H-indol-3-yl]amino}pyridine-4-carboxylic acid::US10040779, Example 59::US10336727, Example 59::US9617242, Example 59
SMILES OC(=O)c1ccncc1Nc1cn(CCC(F)(F)F)c2ccc(Cl)cc12
InChI Key InChIKey=WAMJDGIWWXXCGE-UHFFFAOYSA-N
Data  3 IC50
  Tab Delimited (TSV)   2D SDfile   Computed 3D by Vconf -m prep SDfile
Find this compound or compounds like it in BindingDB:
Activity Spreadsheet -- Enzyme Inhibition Constant Data from BindingDB
Found 3 hits for monomerid = 277762
TargetLysine-specific demethylase 5A(Homo sapiens (Human))
Celgene Quanticel Research
US Patent
LigandPNGBDBM277762(3-{[5-chloro-1-(3,3,3-trifluoropropyl)-1H-indol-3-...)
Affinity DataIC50: <100nM. Assay description: The enzymatic assay of Jarid1A activity is based upon Time Resolved-Fluorescence Resonance Energy Transfer (TR-FRET) detection. The ability of test c...
Ligand InfoPC cidPC sid
In DepthDetails US Patent
TargetLysine-specific demethylase 4C(Homo sapiens (Human))
Celgene Quanticel Research
US Patent
LigandPNGBDBM277762(3-{[5-chloro-1-(3,3,3-trifluoropropyl)-1H-indol-3-...)
Affinity DataIC50:  550nM. Assay description: The ability of test compounds to inhibit the activity of JMJD2C was determined in 384-well plate format under the following reaction conditions: 0.3 ...
Ligand InfoPC cidPC sid
In DepthDetails US Patent
TargetLysine-specific demethylase 5B(Homo sapiens (Human))
Celgene Quanticel Research
US Patent
LigandPNGBDBM277762(3-{[5-chloro-1-(3,3,3-trifluoropropyl)-1H-indol-3-...)
Affinity DataIC50: <100nM. Assay description: The ability of test compounds to inhibit the activity of Jarid1B was determined in 384-well plate format under the following reaction conditions: 0.8...
Ligand InfoPC cidPC sid
In DepthDetails US Patent