BDBM27804 2-{[2-({1-[2-(azetidin-1-yl)acetyl]-5-methoxy-2,3-dihydro-1H-indol-6-yl}amino)-7H-pyrrolo[2,3-d]pyrimidin-4-yl]amino}-6-fluorobenzamide::pyrrolo[2,3-d]pyrimidine deriv., 28
SMILES COc1cc2CCN(C(=O)CN3CCC3)c2cc1Nc1nc(Nc2cccc(F)c2C(N)=O)c2cc[nH]c2n1
InChI Key InChIKey=DUOSEXDXCYSSSZ-UHFFFAOYSA-N
Data  2 IC50
  Tab Delimited (TSV)   2D SDfile   Computed 3D by Vconf -m prep SDfile
Find this compound or compounds like it in BindingDB:
Activity Spreadsheet -- Enzyme Inhibition Constant Data from BindingDB
Found 2 hits for monomerid = 27804
TargetMitogen-activated protein kinase 8(Homo sapiens (Human))
Gsk
LigandPNGBDBM27804(2-{[2-({1-[2-(azetidin-1-yl)acetyl]-5-methoxy-2,3-...)
Affinity DataIC50:  2.00E+3nM. Assay description: Assays are performed in 384-well microtiter plates in reaction buffer containing substrate GST-biotin-C-JUN, ATP, and purified activated JNK1alpha1 i...
In DepthDetails ArticlePubMed
TargetInsulin-like growth factor 1 receptor(Homo sapiens (Human))
Gsk
LigandPNGBDBM27804(2-{[2-({1-[2-(azetidin-1-yl)acetyl]-5-methoxy-2,3-...)
Affinity DataIC50:  1nMpH: 7.5 T: 2°C. Assay description: Assays are performed in 384-well microtiter plates in reaction buffer containing biotinylated substrate, ATP, and purified activated GST-IGF-1R in th...
In DepthDetails ArticlePubMed