BDBM278295 5-(4-((3,4-dihydro-2H-benzo[b][1,4]oxazin-6-yl)amino)-1,3,5-triazin-2-yl)-2-(((3R,4S)-3-fluoro-1-((S)-2-hydroxypropanoyl)piperidin-4-yl)oxy)benzonitrile::US10040781, Example 517::US10253019, Example 517
SMILES C[C@H](O)C(=O)N1CC[C@H](Oc2ccc(cc2C#N)-c2ncnc(Nc3ccc4OCCNc4c3)n2)[C@H](F)C1
InChI Key InChIKey=IQQCLKRZDHVEJC-LYLBAIIYSA-N
Data  6 IC50
  Tab Delimited (TSV)   2D SDfile   Computed 3D by Vconf -m prep SDfile
Find this compound or compounds like it in BindingDB:
Activity Spreadsheet -- Enzyme Inhibition Constant Data from BindingDB
Found 6 hits for monomerid = 278295
TargetSerine/threonine-protein kinase TBK1(Homo sapiens (Human))
Gilead Sciences
US Patent
LigandPNGBDBM278295(5-(4-((3,4-dihydro-2H-benzo[b][1,4]oxazin-6-yl)ami...)
Affinity DataIC50:  2.00E+3nMpH: 7.0Assay Description:Enzymatic activity of IKKε and TBK1 was measured using a homogeneous time resolved fluorescence resonance energy transfer (TR-FRET) assay that m...
Ligand InfoPC cidPC sid
In DepthDetails US Patent
TargetInhibitor of nuclear factor kappa-B kinase subunit epsilon(Homo sapiens (Human))
Gilead Sciences
US Patent
LigandPNGBDBM278295(5-(4-((3,4-dihydro-2H-benzo[b][1,4]oxazin-6-yl)ami...)
Affinity DataIC50:  1.00E+3nMpH: 7.0Assay Description:Enzymatic activity of IKKε and TBK1 was measured using a homogeneous time resolved fluorescence resonance energy transfer (TR-FRET) assay that m...
Ligand InfoPC cidPC sid
In DepthDetails US Patent
TargetTyrosine-protein kinase JAK2(Homo sapiens (Human))
Gilead Sciences
US Patent
LigandPNGBDBM278295(5-(4-((3,4-dihydro-2H-benzo[b][1,4]oxazin-6-yl)ami...)
Affinity DataIC50:  828nM. Assay description: Enzymatic activity of hJAK2 was measured using a LANCE homogeneous time resolved fluorescence resonance energy transfer (TR-FRET) assay that monitors...
Ligand InfoPC cidPC sid
In DepthDetails US Patent
TargetSerine/threonine-protein kinase TBK1(Homo sapiens (Human))
Gilead Sciences
US Patent
LigandPNGBDBM278295(5-(4-((3,4-dihydro-2H-benzo[b][1,4]oxazin-6-yl)ami...)
Affinity DataIC50:  2nM. Assay description: Enzymatic activity of IKKε and TBK1 was measured using a homogeneous time resolved fluorescence resonance energy transfer (TR-FRET) assay that m...
Ligand InfoPC cidPC sid
In DepthDetails US Patent
TargetInhibitor of nuclear factor kappa-B kinase subunit epsilon(Homo sapiens (Human))
Gilead Sciences
US Patent
LigandPNGBDBM278295(5-(4-((3,4-dihydro-2H-benzo[b][1,4]oxazin-6-yl)ami...)
Affinity DataIC50:  1nM. Assay description: Enzymatic activity of IKKε and TBK1 was measured using a homogeneous time resolved fluorescence resonance energy transfer (TR-FRET) assay that m...
Ligand InfoPC cidPC sid
In DepthDetails US Patent
TargetTyrosine-protein kinase JAK2(Homo sapiens (Human))
Gilead Sciences
US Patent
LigandPNGBDBM278295(5-(4-((3,4-dihydro-2H-benzo[b][1,4]oxazin-6-yl)ami...)
Affinity DataIC50:  8.28E+5nMpH: 7.5Assay Description:Enzymatic activity of hJAK2 was measured using a LANCE homogeneous time resolved fluorescence resonance energy transfer (TR-FRET) assay that monitors...
Ligand InfoPC cidPC sid
In DepthDetails US Patent