BDBM27858 N-[(4-fluorophenyl)methyl]-1-hydroxy-6-oxo-1,6-dihydropyridine-2-carboxamide::N-hydroxypyridinone amide, 10a
SMILES On1c(cccc1=O)C(=O)NCc1ccc(F)cc1
InChI Key InChIKey=RKEDFOTZLWMZKJ-UHFFFAOYSA-N
Data  1 IC50
  Tab Delimited (TSV)   2D SDfile   Computed 3D by Vconf -m prep SDfile
Find this compound or compounds like it in BindingDB:
Activity Spreadsheet -- Enzyme Inhibition Constant Data from BindingDB
Found 1 hit for monomerid = 27858
TargetLethal factor(Bacillus anthracis)
Howard Hughes Medical Institute
LigandPNGBDBM27858(N-[(4-fluorophenyl)methyl]-1-hydroxy-6-oxo-1,6-dih...)
Affinity DataIC50: >1.00E+5nMpH: 7.0 T: 2°C. Assay description: Fluorescence peptide cleavage assay was performed in a 96-well plate. Each reaction contained fluorogenic peptide substrate, LF, and small-molecule i...
In DepthDetails ArticlePubMed