BDBM278866 2-(3,8- diazabicyclo[3.2.1]oct- 8-yl)-N-[1-methyl-3- (trifluoromethyl)-1H- pyrazol-4- yl]thieno[2,3-b] pyrazine-7- carboxamide trifluoroacetate::US10040802, Example 45
SMILES OC(=O)C(F)(F)F.Cn1cc(NC(=O)c2csc3ncc(nc23)N2C3CCC2CNC3)c(n1)C(F)(F)F
InChI Key InChIKey=CFGZDBSFDVOYOX-UHFFFAOYSA-N
Data  1 IC50
  Tab Delimited (TSV)   2D SDfile   Computed 3D by Vconf -m prep SDfile
Find this compound or compounds like it in BindingDB:
Activity Spreadsheet -- Enzyme Inhibition Constant Data from BindingDB
Found 1 hit for monomerid = 278866
TargetInterleukin-1 receptor-associated kinase 4(Homo sapiens (Human))
Merck Sharp & Dohme
US Patent
LigandPNGBDBM278866(2-(3,8- diazabicyclo[3.2.1]oct- 8-yl)-N-[1-methyl-...)
Affinity DataIC50:  2nMpH: 7.2Assay Description:The kinase activity of IRAK4 is determined by its ability to catalyze the phosphorylation of a fluorescent polypeptide substrate. The extent of phosp...
Ligand InfoPC cidPC sid
In DepthDetails US Patent