BDBM278892 2-{[(1R,2R)-2-amino- 3,3-difluorocyclohexyl] amino}-N-(2- bromothiophen-3-yl) thieno[2,3-b] pyrazine-7- carboxamide trifluoroacetate::US10040802, Example 71
SMILES OC(=O)C(F)(F)F.N[C@@H]1[C@@H](CCCC1(F)F)Nc1cnc2scc(C(=O)Nc3ccsc3Br)c2n1
InChI Key InChIKey=FJMICBZNCMNOLR-BDROLASLSA-N
Data  1 IC50
  Tab Delimited (TSV)   2D SDfile   Computed 3D by Vconf -m prep SDfile
Find this compound or compounds like it in BindingDB:
Activity Spreadsheet -- Enzyme Inhibition Constant Data from BindingDB
Found 1 hit for monomerid = 278892
TargetInterleukin-1 receptor-associated kinase 4(Homo sapiens (Human))
Merck Sharp & Dohme
US Patent
LigandPNGBDBM278892(2-{[(1R,2R)-2-amino- 3,3-difluorocyclohexyl] amino...)
Affinity DataIC50:  2.07E+3nMpH: 7.2Assay Description:The kinase activity of IRAK4 is determined by its ability to catalyze the phosphorylation of a fluorescent polypeptide substrate. The extent of phosp...
Ligand InfoPC cidPC sid
In DepthDetails US Patent