BDBM278960 US10040815, Example 24-A::US10618929, Example 24-A
SMILES Nc1nc2n([C@@H]3O[C@@H](C[C@H]3O)C(O)C=C)c(=O)sc2c(=O)[nH]1
InChI Key
Data  2 EC50
  Tab Delimited (TSV)   2D SDfile   Computed 3D by Vconf -m prep SDfile
Find this compound or compounds like it in BindingDB:
Activity Spreadsheet -- Enzyme Inhibition Constant Data from BindingDB
Found 2 hits for monomerid = 278960
TargetToll-like receptor 7(Homo sapiens (Human))
Hoffmann-La Roche
US Patent
LigandPNGBDBM278960(US10040815, Example 24-A | US10618929, Example 24-...)
Affinity DataEC50:  7.00E+4nM. Assay description: A stable HEK293-Blue-hTLR-7 cell line was purchased from InvivoGen (Cat. #: hkb-ht1r7, San Diego, Calif., USA). These cells were designed for studyin...
Ligand InfoPC cidPC sid
In DepthDetails US Patent
TargetToll-like receptor 7(Homo sapiens (Human))
Hoffmann-La Roche
US Patent
LigandPNGBDBM278960(US10040815, Example 24-A | US10618929, Example 24-...)
Affinity DataEC50:  7.00E+4nM. Assay description: A stable HEK293-Blue-hTLR-7 cell line was purchased from InvivoGen (Cat.#: hkb-htlr7, San Diego, Calif., USA). These cells were designed for studying...
Ligand InfoPC cidPC sid
In DepthDetails US Patent