BDBM278971 5-(2-ethoxy-3-pyridyl)-1-isopropyl-3-methyl-N-[(5-methyl-1,3,4-oxadiazol-2-yl)methyl]pyrazolo[4,3-b]pyridin-7-amine::US10034861, Example 1::US10512632, Example 1::US10618913, Example S1::US10766893, Example S1::US10806718, Example 1::US11026923, Example 1::US11491140, Example 1::US11634416, Example 1
SMILES CCOc1ncccc1-c1cc(NCc2nnc(C)o2)c2n(nc(C)c2n1)C(C)C
InChI Key InChIKey=XEBJMVLHZBRKST-UHFFFAOYSA-N
Data  24 IC50
  Tab Delimited (TSV)   2D SDfile   Computed 3D by Vconf -m prep SDfile
Find this compound or compounds like it in BindingDB:
Activity Spreadsheet -- Enzyme Inhibition Constant Data from BindingDB
Found 24 hits for monomerid = 278971
LigandPNGBDBM278971(5-(2-ethoxy-3-pyridyl)-1-isopropyl-3-methyl-N-[(5-...)
Affinity DataIC50:  18nMpH: 7.6 T: 2°C. Assay description: PDE1A, PDE1B and PDE1C assays were performed as follows: the assays was performed in 60 μL samples containing a fixed amount of the PDE1 enzyme ...
Ligand InfoPC cidPC sid
In DepthDetails US Patent
LigandPNGBDBM278971(5-(2-ethoxy-3-pyridyl)-1-isopropyl-3-methyl-N-[(5-...)
Affinity DataIC50:  40nM. Assay description: PDE1A, PDE1B and PDE1C assays were performed as follows: the assays was performed in 60 μL samples containing a fixed amount of the PDE1 enzyme ...
Ligand InfoPC cidPC sid
In DepthDetails US Patent
LigandPNGBDBM278971(5-(2-ethoxy-3-pyridyl)-1-isopropyl-3-methyl-N-[(5-...)
Affinity DataIC50:  40nMpH: 7.6 T: 2°C. Assay description: PDE1A, PDE1B and PDE1C assays were performed as follows: the assays was performed in 60 μL samples containing a fixed amount of the PDE1 enzyme ...
Ligand InfoPC cidPC sid
In DepthDetails US Patent
LigandPNGBDBM278971(5-(2-ethoxy-3-pyridyl)-1-isopropyl-3-methyl-N-[(5-...)
Affinity DataIC50:  18nM. Assay description: PDE1A, PDE1B and PDE1C assays were performed as follows: the assays was performed in 60 μL samples containing a fixed amount of the PDE1 enzyme ...
Ligand InfoPC cidPC sid
In DepthDetails US Patent
LigandPNGBDBM278971(5-(2-ethoxy-3-pyridyl)-1-isopropyl-3-methyl-N-[(5-...)
Affinity DataIC50:  1.60nM. Assay description: PDE1A, PDE1B and PDE1C assays were performed as follows: the assays was performed in 60 μL samples containing a fixed amount of the PDE1 enzyme ...
Ligand InfoPC cidPC sid
In DepthDetails US Patent
LigandPNGBDBM278971(5-(2-ethoxy-3-pyridyl)-1-isopropyl-3-methyl-N-[(5-...)
Affinity DataIC50:  40nM. Assay description: PDE1A, PDE1B and PDE1C assays were performed as follows: the assays was performed in 60 μL samples containing a fixed amount of the PDE1 enzyme ...
Ligand InfoPC cidPC sid
In DepthDetails US Patent
LigandPNGBDBM278971(5-(2-ethoxy-3-pyridyl)-1-isopropyl-3-methyl-N-[(5-...)
Affinity DataIC50:  18nM. Assay description: PDE1A, PDE1B and PDE1C assays were performed as follows: the assays were performed in 60 μL samples containing a fixed amount of the PDE1 enzyme...
Ligand InfoPC cidPC sid
In DepthDetails US Patent
LigandPNGBDBM278971(5-(2-ethoxy-3-pyridyl)-1-isopropyl-3-methyl-N-[(5-...)
Affinity DataIC50:  1.60nM. Assay description: PDE1A, PDE1B and PDE1C assays were performed as follows: the assays were performed in 60 μL samples containing a fixed amount of the PDE1 enzyme...
Ligand InfoPC cidPC sid
In DepthDetails US Patent
LigandPNGBDBM278971(5-(2-ethoxy-3-pyridyl)-1-isopropyl-3-methyl-N-[(5-...)
Affinity DataIC50:  40nM. Assay description: PDE1A, PDE1B and PDE1C assays were performed as follows: the assays were performed in 60 μL samples containing a fixed amount of the PDE1 enzyme...
Ligand InfoPC cidPC sid
In DepthDetails US Patent
LigandPNGBDBM278971(5-(2-ethoxy-3-pyridyl)-1-isopropyl-3-methyl-N-[(5-...)
Affinity DataIC50:  18nM. Assay description: PDE1A, PDE1B and PDE1C assays were performed as follows: the assays were performed in 60 μL samples containing a fixed amount of the PDE1 enzyme...
Ligand InfoPC cidPC sid
In DepthDetails US Patent
LigandPNGBDBM278971(5-(2-ethoxy-3-pyridyl)-1-isopropyl-3-methyl-N-[(5-...)
Affinity DataIC50:  1.60nM. Assay description: PDE1A, PDE1B and PDE1C assays were performed as follows: the assays were performed in 60 μL samples containing a fixed amount of the PDE1 enzyme...
Ligand InfoPC cidPC sid
In DepthDetails US Patent
LigandPNGBDBM278971(5-(2-ethoxy-3-pyridyl)-1-isopropyl-3-methyl-N-[(5-...)
Affinity DataIC50:  40nM. Assay description: PDE1A, PDE1B and PDE1C assays were performed as follows: the assays were performed in 60 μL samples containing a fixed amount of the PDE1 enzyme...
Ligand InfoPC cidPC sid
In DepthDetails US Patent
LigandPNGBDBM278971(5-(2-ethoxy-3-pyridyl)-1-isopropyl-3-methyl-N-[(5-...)
Affinity DataIC50:  18nM. Assay description: PDE1A, PDE1B and PDE1C assays were performed as follows: the assays was performed in 60 μL samples containing a fixed amount of the PDE1 enzyme ...
Ligand InfoPC cidPC sid
In DepthDetails US Patent
LigandPNGBDBM278971(5-(2-ethoxy-3-pyridyl)-1-isopropyl-3-methyl-N-[(5-...)
Affinity DataIC50:  1.60nM. Assay description: PDE1A, PDE1B and PDE1C assays were performed as follows: the assays was performed in 60 μL samples containing a fixed amount of the PDE1 enzyme ...
Ligand InfoPC cidPC sid
In DepthDetails US Patent
LigandPNGBDBM278971(5-(2-ethoxy-3-pyridyl)-1-isopropyl-3-methyl-N-[(5-...)
Affinity DataIC50:  40nM. Assay description: PDE1A, PDE1B and PDE1C assays were performed as follows: the assays was performed in 60 μL samples containing a fixed amount of the PDE1 enzyme ...
Ligand InfoPC cidPC sid
In DepthDetails US Patent
LigandPNGBDBM278971(5-(2-ethoxy-3-pyridyl)-1-isopropyl-3-methyl-N-[(5-...)
Affinity DataIC50:  18nM. Assay description: PDE1A, PDE1B and PDE1C assays were performed as follows: the assays was performed in 60 uL samples containing a fixed amount of the PDE1 enzyme (suff...
Ligand InfoPC cidPC sid
In DepthDetails US Patent
LigandPNGBDBM278971(5-(2-ethoxy-3-pyridyl)-1-isopropyl-3-methyl-N-[(5-...)
Affinity DataIC50:  1.60nM. Assay description: PDE1A, PDE1B and PDE1C assays were performed as follows: the assays was performed in 60 uL samples containing a fixed amount of the PDE1 enzyme (suff...
Ligand InfoPC cidPC sid
In DepthDetails US Patent
LigandPNGBDBM278971(5-(2-ethoxy-3-pyridyl)-1-isopropyl-3-methyl-N-[(5-...)
Affinity DataIC50:  40nM. Assay description: PDE1A, PDE1B and PDE1C assays were performed as follows: the assays was performed in 60 uL samples containing a fixed amount of the PDE1 enzyme (suff...
Ligand InfoPC cidPC sid
In DepthDetails US Patent
LigandPNGBDBM278971(5-(2-ethoxy-3-pyridyl)-1-isopropyl-3-methyl-N-[(5-...)
Affinity DataIC50:  18nM. Assay description: PDE1A, PDE1B and PDE1C assays were performed as follows: the assays was performed in 60 μL samples containing a fixed amount of the PDE1 enzyme ...
Ligand InfoPC cidPC sid
In DepthDetails US Patent
LigandPNGBDBM278971(5-(2-ethoxy-3-pyridyl)-1-isopropyl-3-methyl-N-[(5-...)
Affinity DataIC50:  1.60nM. Assay description: PDE1A, PDE1B and PDE1C assays were performed as follows: the assays was performed in 60 μL samples containing a fixed amount of the PDE1 enzyme ...
Ligand InfoPC cidPC sid
In DepthDetails US Patent
LigandPNGBDBM278971(5-(2-ethoxy-3-pyridyl)-1-isopropyl-3-methyl-N-[(5-...)
Affinity DataIC50:  40nM. Assay description: PDE1A, PDE1B and PDE1C assays were performed as follows: the assays was performed in 60 μL samples containing a fixed amount of the PDE1 enzyme ...
Ligand InfoPC cidPC sid
In DepthDetails US Patent
LigandPNGBDBM278971(5-(2-ethoxy-3-pyridyl)-1-isopropyl-3-methyl-N-[(5-...)
Affinity DataIC50:  18nM. Assay description: PDE1A, PDE1B and PDE1C assays were performed as follows: the assays was performed in 60 μL samples containing a fixed amount of the PDE1 enzyme ...
Ligand InfoPC cidPC sid
In DepthDetails US Patent
LigandPNGBDBM278971(5-(2-ethoxy-3-pyridyl)-1-isopropyl-3-methyl-N-[(5-...)
Affinity DataIC50:  1.60nM. Assay description: PDE1A, PDE1B and PDE1C assays were performed as follows: the assays was performed in 60 μL samples containing a fixed amount of the PDE1 enzyme ...
Ligand InfoPC cidPC sid
In DepthDetails US Patent
LigandPNGBDBM278971(5-(2-ethoxy-3-pyridyl)-1-isopropyl-3-methyl-N-[(5-...)
Affinity DataIC50:  1.60nMpH: 7.6 T: 2°C. Assay description: PDE1A, PDE1B and PDE1C assays were performed as follows: the assays was performed in 60 μL samples containing a fixed amount of the PDE1 enzyme ...
Ligand InfoPC cidPC sid
In DepthDetails US Patent