BDBM278983 5-(2-ethoxy-3-pyridyl)-N-[(1-methylpyrazol-4-yl)methyl]-1-propyl-pyrazolo[4,3-b]pyridin-7-amine::US10034861, Example 13::US10512632, Example 13::US10618913, Example S13::US10766893, Example S13::US10806718, Example 13::US11026923, Example 13::US11491140, Example 13::US11634416, Example 13
SMILES CCCn1ncc2nc(cc(NCc3cnn(C)c3)c12)-c1cccnc1OCC
InChI Key InChIKey=VBBYLKGVLRZVDT-UHFFFAOYSA-N
Data  24 IC50
  Tab Delimited (TSV)   2D SDfile   Computed 3D by Vconf -m prep SDfile
Find this compound or compounds like it in BindingDB:
Activity Spreadsheet -- Enzyme Inhibition Constant Data from BindingDB
Found 24 hits for monomerid = 278983
LigandPNGBDBM278983(5-(2-ethoxy-3-pyridyl)-N-[(1-methylpyrazol-4-yl)me...)
Affinity DataIC50:  90nMpH: 7.6 T: 2°C. Assay description: PDE1A, PDE1B and PDE1C assays were performed as follows: the assays was performed in 60 μL samples containing a fixed amount of the PDE1 enzyme ...
Ligand InfoPC cidPC sid
In DepthDetails US Patent
LigandPNGBDBM278983(5-(2-ethoxy-3-pyridyl)-N-[(1-methylpyrazol-4-yl)me...)
Affinity DataIC50:  340nM. Assay description: PDE1A, PDE1B and PDE1C assays were performed as follows: the assays was performed in 60 μL samples containing a fixed amount of the PDE1 enzyme ...
Ligand InfoPC cidPC sid
In DepthDetails US Patent
LigandPNGBDBM278983(5-(2-ethoxy-3-pyridyl)-N-[(1-methylpyrazol-4-yl)me...)
Affinity DataIC50:  340nMpH: 7.6 T: 2°C. Assay description: PDE1A, PDE1B and PDE1C assays were performed as follows: the assays was performed in 60 μL samples containing a fixed amount of the PDE1 enzyme ...
Ligand InfoPC cidPC sid
In DepthDetails US Patent
LigandPNGBDBM278983(5-(2-ethoxy-3-pyridyl)-N-[(1-methylpyrazol-4-yl)me...)
Affinity DataIC50:  90nM. Assay description: PDE1A, PDE1B and PDE1C assays were performed as follows: the assays was performed in 60 μL samples containing a fixed amount of the PDE1 enzyme ...
Ligand InfoPC cidPC sid
In DepthDetails US Patent
LigandPNGBDBM278983(5-(2-ethoxy-3-pyridyl)-N-[(1-methylpyrazol-4-yl)me...)
Affinity DataIC50:  15nM. Assay description: PDE1A, PDE1B and PDE1C assays were performed as follows: the assays was performed in 60 μL samples containing a fixed amount of the PDE1 enzyme ...
Ligand InfoPC cidPC sid
In DepthDetails US Patent
LigandPNGBDBM278983(5-(2-ethoxy-3-pyridyl)-N-[(1-methylpyrazol-4-yl)me...)
Affinity DataIC50:  340nM. Assay description: PDE1A, PDE1B and PDE1C assays were performed as follows: the assays was performed in 60 μL samples containing a fixed amount of the PDE1 enzyme ...
Ligand InfoPC cidPC sid
In DepthDetails US Patent
LigandPNGBDBM278983(5-(2-ethoxy-3-pyridyl)-N-[(1-methylpyrazol-4-yl)me...)
Affinity DataIC50:  90nM. Assay description: PDE1A, PDE1B and PDE1C assays were performed as follows: the assays were performed in 60 μL samples containing a fixed amount of the PDE1 enzyme...
Ligand InfoPC cidPC sid
In DepthDetails US Patent
LigandPNGBDBM278983(5-(2-ethoxy-3-pyridyl)-N-[(1-methylpyrazol-4-yl)me...)
Affinity DataIC50:  15nM. Assay description: PDE1A, PDE1B and PDE1C assays were performed as follows: the assays were performed in 60 μL samples containing a fixed amount of the PDE1 enzyme...
Ligand InfoPC cidPC sid
In DepthDetails US Patent
LigandPNGBDBM278983(5-(2-ethoxy-3-pyridyl)-N-[(1-methylpyrazol-4-yl)me...)
Affinity DataIC50:  340nM. Assay description: PDE1A, PDE1B and PDE1C assays were performed as follows: the assays were performed in 60 μL samples containing a fixed amount of the PDE1 enzyme...
Ligand InfoPC cidPC sid
In DepthDetails US Patent
LigandPNGBDBM278983(5-(2-ethoxy-3-pyridyl)-N-[(1-methylpyrazol-4-yl)me...)
Affinity DataIC50:  90nM. Assay description: PDE1A, PDE1B and PDE1C assays were performed as follows: the assays were performed in 60 μL samples containing a fixed amount of the PDE1 enzyme...
Ligand InfoPC cidPC sid
In DepthDetails US Patent
LigandPNGBDBM278983(5-(2-ethoxy-3-pyridyl)-N-[(1-methylpyrazol-4-yl)me...)
Affinity DataIC50:  15nM. Assay description: PDE1A, PDE1B and PDE1C assays were performed as follows: the assays were performed in 60 μL samples containing a fixed amount of the PDE1 enzyme...
Ligand InfoPC cidPC sid
In DepthDetails US Patent
LigandPNGBDBM278983(5-(2-ethoxy-3-pyridyl)-N-[(1-methylpyrazol-4-yl)me...)
Affinity DataIC50:  340nM. Assay description: PDE1A, PDE1B and PDE1C assays were performed as follows: the assays were performed in 60 μL samples containing a fixed amount of the PDE1 enzyme...
Ligand InfoPC cidPC sid
In DepthDetails US Patent
LigandPNGBDBM278983(5-(2-ethoxy-3-pyridyl)-N-[(1-methylpyrazol-4-yl)me...)
Affinity DataIC50:  90nM. Assay description: PDE1A, PDE1B and PDE1C assays were performed as follows: the assays was performed in 60 μL samples containing a fixed amount of the PDE1 enzyme ...
Ligand InfoPC cidPC sid
In DepthDetails US Patent
LigandPNGBDBM278983(5-(2-ethoxy-3-pyridyl)-N-[(1-methylpyrazol-4-yl)me...)
Affinity DataIC50:  15nM. Assay description: PDE1A, PDE1B and PDE1C assays were performed as follows: the assays was performed in 60 μL samples containing a fixed amount of the PDE1 enzyme ...
Ligand InfoPC cidPC sid
In DepthDetails US Patent
LigandPNGBDBM278983(5-(2-ethoxy-3-pyridyl)-N-[(1-methylpyrazol-4-yl)me...)
Affinity DataIC50:  340nM. Assay description: PDE1A, PDE1B and PDE1C assays were performed as follows: the assays was performed in 60 μL samples containing a fixed amount of the PDE1 enzyme ...
Ligand InfoPC cidPC sid
In DepthDetails US Patent
LigandPNGBDBM278983(5-(2-ethoxy-3-pyridyl)-N-[(1-methylpyrazol-4-yl)me...)
Affinity DataIC50:  90nM. Assay description: PDE1A, PDE1B and PDE1C assays were performed as follows: the assays was performed in 60 uL samples containing a fixed amount of the PDE1 enzyme (suff...
Ligand InfoPC cidPC sid
In DepthDetails US Patent
LigandPNGBDBM278983(5-(2-ethoxy-3-pyridyl)-N-[(1-methylpyrazol-4-yl)me...)
Affinity DataIC50:  15nM. Assay description: PDE1A, PDE1B and PDE1C assays were performed as follows: the assays was performed in 60 uL samples containing a fixed amount of the PDE1 enzyme (suff...
Ligand InfoPC cidPC sid
In DepthDetails US Patent
LigandPNGBDBM278983(5-(2-ethoxy-3-pyridyl)-N-[(1-methylpyrazol-4-yl)me...)
Affinity DataIC50:  340nM. Assay description: PDE1A, PDE1B and PDE1C assays were performed as follows: the assays was performed in 60 uL samples containing a fixed amount of the PDE1 enzyme (suff...
Ligand InfoPC cidPC sid
In DepthDetails US Patent
LigandPNGBDBM278983(5-(2-ethoxy-3-pyridyl)-N-[(1-methylpyrazol-4-yl)me...)
Affinity DataIC50:  90nM. Assay description: PDE1A, PDE1B and PDE1C assays were performed as follows: the assays was performed in 60 μL samples containing a fixed amount of the PDE1 enzyme ...
Ligand InfoPC cidPC sid
In DepthDetails US Patent
LigandPNGBDBM278983(5-(2-ethoxy-3-pyridyl)-N-[(1-methylpyrazol-4-yl)me...)
Affinity DataIC50:  15nM. Assay description: PDE1A, PDE1B and PDE1C assays were performed as follows: the assays was performed in 60 μL samples containing a fixed amount of the PDE1 enzyme ...
Ligand InfoPC cidPC sid
In DepthDetails US Patent
LigandPNGBDBM278983(5-(2-ethoxy-3-pyridyl)-N-[(1-methylpyrazol-4-yl)me...)
Affinity DataIC50:  340nM. Assay description: PDE1A, PDE1B and PDE1C assays were performed as follows: the assays was performed in 60 μL samples containing a fixed amount of the PDE1 enzyme ...
Ligand InfoPC cidPC sid
In DepthDetails US Patent
LigandPNGBDBM278983(5-(2-ethoxy-3-pyridyl)-N-[(1-methylpyrazol-4-yl)me...)
Affinity DataIC50:  90nM. Assay description: PDE1A, PDE1B and PDE1C assays were performed as follows: the assays was performed in 60 μL samples containing a fixed amount of the PDE1 enzyme ...
Ligand InfoPC cidPC sid
In DepthDetails US Patent
LigandPNGBDBM278983(5-(2-ethoxy-3-pyridyl)-N-[(1-methylpyrazol-4-yl)me...)
Affinity DataIC50:  15nM. Assay description: PDE1A, PDE1B and PDE1C assays were performed as follows: the assays was performed in 60 μL samples containing a fixed amount of the PDE1 enzyme ...
Ligand InfoPC cidPC sid
In DepthDetails US Patent
LigandPNGBDBM278983(5-(2-ethoxy-3-pyridyl)-N-[(1-methylpyrazol-4-yl)me...)
Affinity DataIC50:  15nMpH: 7.6 T: 2°C. Assay description: PDE1A, PDE1B and PDE1C assays were performed as follows: the assays was performed in 60 μL samples containing a fixed amount of the PDE1 enzyme ...
Ligand InfoPC cidPC sid
In DepthDetails US Patent