BDBM278999 5-(2-ethoxy-3-pyridyl)-1-isopropyl-3-methyl-N-[(4-methylthiazol-2-yl)methyl]pyrazolo[4,3-b]pyridin-7-amine::US10034861, Example 29::US10512632, Example 29::US10618913, Example S162::US10766893, Example S29::US10806718, Example 29::US11026923, Example 29::US11491140, Example 29::US11634416, Example 29
SMILES CCOc1ncccc1-c1cc(NCc2nc(C)cs2)c2n(nc(C)c2n1)C(C)C
InChI Key InChIKey=WFSFSRAGPIZNCC-UHFFFAOYSA-N
Data  27 IC50
  Tab Delimited (TSV)   2D SDfile   Computed 3D by Vconf -m prep SDfile
Find this compound or compounds like it in BindingDB:
Activity Spreadsheet -- Enzyme Inhibition Constant Data from BindingDB
Found 27 hits for monomerid = 278999
LigandPNGBDBM278999(5-(2-ethoxy-3-pyridyl)-1-isopropyl-3-methyl-N-[(4-...)
Affinity DataIC50:  27nMpH: 7.6 T: 2°C. Assay description: PDE1A, PDE1B and PDE1C assays were performed as follows: the assays was performed in 60 μL samples containing a fixed amount of the PDE1 enzyme ...
Ligand InfoPC cidPC sid
In DepthDetails US Patent
LigandPNGBDBM278999(5-(2-ethoxy-3-pyridyl)-1-isopropyl-3-methyl-N-[(4-...)
Affinity DataIC50:  44nM. Assay description: PDE1A, PDE1B and PDE1C assays were performed as follows: the assays was performed in 60 μL samples containing a fixed amount of the PDE1 enzyme ...
Ligand InfoPC cidPC sid
In DepthDetails US Patent
LigandPNGBDBM278999(5-(2-ethoxy-3-pyridyl)-1-isopropyl-3-methyl-N-[(4-...)
Affinity DataIC50:  44nMpH: 7.6 T: 2°C. Assay description: PDE1A, PDE1B and PDE1C assays were performed as follows: the assays was performed in 60 μL samples containing a fixed amount of the PDE1 enzyme ...
Ligand InfoPC cidPC sid
In DepthDetails US Patent
LigandPNGBDBM278999(5-(2-ethoxy-3-pyridyl)-1-isopropyl-3-methyl-N-[(4-...)
Affinity DataIC50:  27nM. Assay description: PDE1A, PDE1B and PDE1C assays were performed as follows: the assays was performed in 60 μL samples containing a fixed amount of the PDE1 enzyme ...
Ligand InfoPC cidPC sid
In DepthDetails US Patent
LigandPNGBDBM278999(5-(2-ethoxy-3-pyridyl)-1-isopropyl-3-methyl-N-[(4-...)
Affinity DataIC50:  1.10nM. Assay description: PDE1A, PDE1B and PDE1C assays were performed as follows: the assays was performed in 60 μL samples containing a fixed amount of the PDE1 enzyme ...
Ligand InfoPC cidPC sid
In DepthDetails US Patent
LigandPNGBDBM278999(5-(2-ethoxy-3-pyridyl)-1-isopropyl-3-methyl-N-[(4-...)
Affinity DataIC50:  44nM. Assay description: PDE1A, PDE1B and PDE1C assays were performed as follows: the assays was performed in 60 μL samples containing a fixed amount of the PDE1 enzyme ...
Ligand InfoPC cidPC sid
In DepthDetails US Patent
LigandPNGBDBM278999(5-(2-ethoxy-3-pyridyl)-1-isopropyl-3-methyl-N-[(4-...)
Affinity DataIC50:  27nM. Assay description: PDE1A, PDE1B and PDE1C assays were performed as follows: the assays were performed in 60 μL samples containing a fixed amount of the PDE1 enzyme...
Ligand InfoPC cidPC sid
In DepthDetails US Patent
LigandPNGBDBM278999(5-(2-ethoxy-3-pyridyl)-1-isopropyl-3-methyl-N-[(4-...)
Affinity DataIC50:  1.10nM. Assay description: PDE1A, PDE1B and PDE1C assays were performed as follows: the assays were performed in 60 μL samples containing a fixed amount of the PDE1 enzyme...
Ligand InfoPC cidPC sid
In DepthDetails US Patent
LigandPNGBDBM278999(5-(2-ethoxy-3-pyridyl)-1-isopropyl-3-methyl-N-[(4-...)
Affinity DataIC50:  44nM. Assay description: PDE1A, PDE1B and PDE1C assays were performed as follows: the assays were performed in 60 μL samples containing a fixed amount of the PDE1 enzyme...
Ligand InfoPC cidPC sid
In DepthDetails US Patent
LigandPNGBDBM278999(5-(2-ethoxy-3-pyridyl)-1-isopropyl-3-methyl-N-[(4-...)
Affinity DataIC50:  100nM. Assay description: PDE1A, PDE1B and PDE1C assays were performed as follows: the assays were performed in 60 μL samples containing a fixed amount of the PDE1 enzyme...
Ligand InfoPC cidPC sid
In DepthDetails US Patent
LigandPNGBDBM278999(5-(2-ethoxy-3-pyridyl)-1-isopropyl-3-methyl-N-[(4-...)
Affinity DataIC50:  13nM. Assay description: PDE1A, PDE1B and PDE1C assays were performed as follows: the assays were performed in 60 μL samples containing a fixed amount of the PDE1 enzyme...
Ligand InfoPC cidPC sid
In DepthDetails US Patent
LigandPNGBDBM278999(5-(2-ethoxy-3-pyridyl)-1-isopropyl-3-methyl-N-[(4-...)
Affinity DataIC50:  180nM. Assay description: PDE1A, PDE1B and PDE1C assays were performed as follows: the assays were performed in 60 μL samples containing a fixed amount of the PDE1 enzyme...
Ligand InfoPC cidPC sid
In DepthDetails US Patent
LigandPNGBDBM278999(5-(2-ethoxy-3-pyridyl)-1-isopropyl-3-methyl-N-[(4-...)
Affinity DataIC50:  27nM. Assay description: PDE1A, PDE1B and PDE1C assays were performed as follows: the assays were performed in 60 μL samples containing a fixed amount of the PDE1 enzyme...
Ligand InfoPC cidPC sid
In DepthDetails US Patent
LigandPNGBDBM278999(5-(2-ethoxy-3-pyridyl)-1-isopropyl-3-methyl-N-[(4-...)
Affinity DataIC50:  1.10nM. Assay description: PDE1A, PDE1B and PDE1C assays were performed as follows: the assays were performed in 60 μL samples containing a fixed amount of the PDE1 enzyme...
Ligand InfoPC cidPC sid
In DepthDetails US Patent
LigandPNGBDBM278999(5-(2-ethoxy-3-pyridyl)-1-isopropyl-3-methyl-N-[(4-...)
Affinity DataIC50:  44nM. Assay description: PDE1A, PDE1B and PDE1C assays were performed as follows: the assays were performed in 60 μL samples containing a fixed amount of the PDE1 enzyme...
Ligand InfoPC cidPC sid
In DepthDetails US Patent
LigandPNGBDBM278999(5-(2-ethoxy-3-pyridyl)-1-isopropyl-3-methyl-N-[(4-...)
Affinity DataIC50:  27nM. Assay description: PDE1A, PDE1B and PDE1C assays were performed as follows: the assays was performed in 60 μL samples containing a fixed amount of the PDE1 enzyme ...
Ligand InfoPC cidPC sid
In DepthDetails US Patent
LigandPNGBDBM278999(5-(2-ethoxy-3-pyridyl)-1-isopropyl-3-methyl-N-[(4-...)
Affinity DataIC50:  1.10nM. Assay description: PDE1A, PDE1B and PDE1C assays were performed as follows: the assays was performed in 60 μL samples containing a fixed amount of the PDE1 enzyme ...
Ligand InfoPC cidPC sid
In DepthDetails US Patent
LigandPNGBDBM278999(5-(2-ethoxy-3-pyridyl)-1-isopropyl-3-methyl-N-[(4-...)
Affinity DataIC50:  44nM. Assay description: PDE1A, PDE1B and PDE1C assays were performed as follows: the assays was performed in 60 μL samples containing a fixed amount of the PDE1 enzyme ...
Ligand InfoPC cidPC sid
In DepthDetails US Patent
LigandPNGBDBM278999(5-(2-ethoxy-3-pyridyl)-1-isopropyl-3-methyl-N-[(4-...)
Affinity DataIC50:  27nM. Assay description: PDE1A, PDE1B and PDE1C assays were performed as follows: the assays was performed in 60 uL samples containing a fixed amount of the PDE1 enzyme (suff...
Ligand InfoPC cidPC sid
In DepthDetails US Patent
LigandPNGBDBM278999(5-(2-ethoxy-3-pyridyl)-1-isopropyl-3-methyl-N-[(4-...)
Affinity DataIC50:  1.10nM. Assay description: PDE1A, PDE1B and PDE1C assays were performed as follows: the assays was performed in 60 uL samples containing a fixed amount of the PDE1 enzyme (suff...
Ligand InfoPC cidPC sid
In DepthDetails US Patent
LigandPNGBDBM278999(5-(2-ethoxy-3-pyridyl)-1-isopropyl-3-methyl-N-[(4-...)
Affinity DataIC50:  44nM. Assay description: PDE1A, PDE1B and PDE1C assays were performed as follows: the assays was performed in 60 uL samples containing a fixed amount of the PDE1 enzyme (suff...
Ligand InfoPC cidPC sid
In DepthDetails US Patent
LigandPNGBDBM278999(5-(2-ethoxy-3-pyridyl)-1-isopropyl-3-methyl-N-[(4-...)
Affinity DataIC50:  27nM. Assay description: PDE1A, PDE1B and PDE1C assays were performed as follows: the assays was performed in 60 μL samples containing a fixed amount of the PDE1 enzyme ...
Ligand InfoPC cidPC sid
In DepthDetails US Patent
LigandPNGBDBM278999(5-(2-ethoxy-3-pyridyl)-1-isopropyl-3-methyl-N-[(4-...)
Affinity DataIC50:  1.10nM. Assay description: PDE1A, PDE1B and PDE1C assays were performed as follows: the assays was performed in 60 μL samples containing a fixed amount of the PDE1 enzyme ...
Ligand InfoPC cidPC sid
In DepthDetails US Patent
LigandPNGBDBM278999(5-(2-ethoxy-3-pyridyl)-1-isopropyl-3-methyl-N-[(4-...)
Affinity DataIC50:  44nM. Assay description: PDE1A, PDE1B and PDE1C assays were performed as follows: the assays was performed in 60 μL samples containing a fixed amount of the PDE1 enzyme ...
Ligand InfoPC cidPC sid
In DepthDetails US Patent
LigandPNGBDBM278999(5-(2-ethoxy-3-pyridyl)-1-isopropyl-3-methyl-N-[(4-...)
Affinity DataIC50:  27nM. Assay description: PDE1A, PDE1B and PDE1C assays were performed as follows: the assays was performed in 60 μL samples containing a fixed amount of the PDE1 enzyme ...
Ligand InfoPC cidPC sid
In DepthDetails US Patent
LigandPNGBDBM278999(5-(2-ethoxy-3-pyridyl)-1-isopropyl-3-methyl-N-[(4-...)
Affinity DataIC50:  1.10nM. Assay description: PDE1A, PDE1B and PDE1C assays were performed as follows: the assays was performed in 60 μL samples containing a fixed amount of the PDE1 enzyme ...
Ligand InfoPC cidPC sid
In DepthDetails US Patent
LigandPNGBDBM278999(5-(2-ethoxy-3-pyridyl)-1-isopropyl-3-methyl-N-[(4-...)
Affinity DataIC50:  1.10nMpH: 7.6 T: 2°C. Assay description: PDE1A, PDE1B and PDE1C assays were performed as follows: the assays was performed in 60 μL samples containing a fixed amount of the PDE1 enzyme ...
Ligand InfoPC cidPC sid
In DepthDetails US Patent