BDBM27916 8-cyclohexyl-N-methoxy-2-{[4-(1-methylpiperidin-4-yl)phenyl]amino}-5-oxo-5H,8H-pyrido[2,3-d]pyrimidine-6-carboxamide::Pyrido[2,3-d]pyrimidin-5-one, 49
SMILES CONC(=O)c1cn(C2CCCCC2)c2nc(Nc3ccc(cc3)C3CCN(C)CC3)ncc2c1=O
InChI Key InChIKey=HMRDXCZNJVAJQN-UHFFFAOYSA-N
Data  1 IC50
  Tab Delimited (TSV)   2D SDfile   Computed 3D by Vconf -m prep SDfile
Find this compound or compounds like it in BindingDB:
Activity Spreadsheet -- Enzyme Inhibition Constant Data from BindingDB
Found 1 hit for monomerid = 27916
TargetMacrophage colony-stimulating factor 1 receptor(Homo sapiens (Human))
Johnson & Johnson Pharmaceutical
LigandPNGBDBM27916(8-cyclohexyl-N-methoxy-2-{[4-(1-methylpiperidin-4-...)
Affinity DataIC50:  5nMpH: 7.5 T: 2°C. Assay description: FMS was assayed using a fluorescence polarization (FP) competition immunoassay that measured FMS phosphorylation of FMS 555-568 peptide at Y561. The ...
In DepthDetails ArticlePubMed