BDBM279303 US10035760, Example 128
SMILES CN(C(=O)[C@H](Cc1ccccc1)NC(=O)NS(=O)(=O)c1ccccc1-c1cccnc1)c1ccc2OCOc2c1
InChI Key InChIKey=IAIBISXJJOYDDN-DEOSSOPVSA-N
Data  1 EC50
  Tab Delimited (TSV)   2D SDfile   Computed 3D by Vconf -m prep SDfile
Find this compound or compounds like it in BindingDB:
Activity Spreadsheet -- Enzyme Inhibition Constant Data from BindingDB
Found 1 hit for monomerid = 279303
TargetEnvelope glycoprotein gp160(Human immunodeficiency virus type 1 (isolate BRU/L...)
Viiv Healthcare UK (NO.5)
US Patent
LigandPNGBDBM279303(US10035760, Example 128)
Affinity DataEC50:  5.50E+3nM. Assay description: HIV cell culture assay¿MT-2 cells, 293T cells and the proviral DNA clone of NL4-3 virus were obtained from the NIH AIDS Research and Reference Reagen...
Ligand InfoPC cidPC sid
In DepthDetails US Patent