BDBM279473 (R)-1-(7-methoxy-5-(3-methoxypyridin-4-yl)-1H-benzo[d]imidazol-2-yl)-3-methylbutan-1-amine::US10035777, Example 23
SMILES COc1cnccc1-c1cc(OC)c2[nH]c(nc2c1)[C@H](N)CC(C)C
InChI Key
Data  1 IC50
  Tab Delimited (TSV)   2D SDfile   Computed 3D by Vconf -m prep SDfile
Find this compound or compounds like it in BindingDB:
Activity Spreadsheet -- Enzyme Inhibition Constant Data from BindingDB
Found 1 hit for monomerid = 279473
TargetAP2-associated protein kinase 1(Homo sapiens (Human))
Bristol-Myers Squibb
US Patent
LigandPNGBDBM279473((R)-1-(7-methoxy-5-(3-methoxypyridin-4-yl)-1H-benz...)
Affinity DataIC50:  553nMpH: 7.4 T: 2°C. Assay description: The assays were performed in U-bottom 384-well plates. The final assay volume was 30 μl prepared from 15 μl additions of enzyme and substra...
Ligand InfoPC cidPC sid
In DepthDetails US Patent