BDBM279475 2-isopentyl-4-methoxy-6-(pyridin-4-yl)-1H-benzo[d]imidazole::US10035777, Example 25
SMILES COc1cc(cc2[nH]c(CCC(C)C)nc12)-c1ccncc1
InChI Key InChIKey=CUHMJSMQTUZFGZ-UHFFFAOYSA-N
Data  1 IC50
  Tab Delimited (TSV)   2D SDfile   Computed 3D by Vconf -m prep SDfile
Find this compound or compounds like it in BindingDB:
Activity Spreadsheet -- Enzyme Inhibition Constant Data from BindingDB
Found 1 hit for monomerid = 279475
TargetAP2-associated protein kinase 1(Homo sapiens (Human))
Bristol-Myers Squibb
US Patent
LigandPNGBDBM279475(2-isopentyl-4-methoxy-6-(pyridin-4-yl)-1H-benzo[d]...)
Affinity DataIC50:  380nMpH: 7.4 T: 2°C. Assay description: The assays were performed in U-bottom 384-well plates. The final assay volume was 30 μl prepared from 15 μl additions of enzyme and substra...
Ligand InfoPC cidPC sid
In DepthDetails US Patent