BDBM279496 (R)-1-(1-ethyl-5-(oxazol-5-yl)-1H-benzo[d]imidazol-2-yl)-3-methylbutan-1-amine::US10035777, Example 46
SMILES CCn1c(nc2cc(ccc12)-c1cnco1)[C@H](N)CC(C)C
InChI Key InChIKey=ZSDFSDWOLGTBKU-CYBMUJFWSA-N
Data  1 IC50
  Tab Delimited (TSV)   2D SDfile   Computed 3D by Vconf -m prep SDfile
Find this compound or compounds like it in BindingDB:
Activity Spreadsheet -- Enzyme Inhibition Constant Data from BindingDB
Found 1 hit for monomerid = 279496
TargetAP2-associated protein kinase 1(Homo sapiens (Human))
Bristol-Myers Squibb
US Patent
LigandPNGBDBM279496((R)-1-(1-ethyl-5-(oxazol-5-yl)-1H-benzo[d]imidazol...)
Affinity DataIC50:  1.54E+3nMpH: 7.4 T: 2°C. Assay description: The assays were performed in U-bottom 384-well plates. The final assay volume was 30 μl prepared from 15 μl additions of enzyme and substra...
Ligand InfoPC cidPC sid
In DepthDetails US Patent