BDBM279514 (R)-cyclohexyl(6-methoxy-5-(oxazol-5-yl)-1H-benzo[d]imidazol-2-yl)methanamine::US10035777, Example 64
SMILES COc1cc2[nH]c(nc2cc1-c1cnco1)[C@H](N)C1CCCCC1
InChI Key
Data  1 IC50
  Tab Delimited (TSV)   2D SDfile   Computed 3D by Vconf -m prep SDfile
Find this compound or compounds like it in BindingDB:
Activity Spreadsheet -- Enzyme Inhibition Constant Data from BindingDB
Found 1 hit for monomerid = 279514
TargetAP2-associated protein kinase 1(Homo sapiens (Human))
Bristol-Myers Squibb
US Patent
LigandPNGBDBM279514((R)-cyclohexyl(6-methoxy-5-(oxazol-5-yl)-1H-benzo[...)
Affinity DataIC50:  16nMpH: 7.4 T: 2°C. Assay description: The assays were performed in U-bottom 384-well plates. The final assay volume was 30 μl prepared from 15 μl additions of enzyme and substra...
Ligand InfoPC cidPC sid
In DepthDetails US Patent