BDBM279551 (R)-N,3-dimethyl-1-(6-(oxazol-5-yl)-1H-benzo[d]imidazol-2-yl) butan-1-amine::US10035777, Example 101
SMILES CN[C@H](CC(C)C)c1nc2ccc(cc2[nH]1)-c1cnco1
InChI Key
Data  1 IC50
  Tab Delimited (TSV)   2D SDfile   Computed 3D by Vconf -m prep SDfile
Find this compound or compounds like it in BindingDB:
Activity Spreadsheet -- Enzyme Inhibition Constant Data from BindingDB
Found 1 hit for monomerid = 279551
TargetAP2-associated protein kinase 1(Homo sapiens (Human))
Bristol-Myers Squibb
US Patent
LigandPNGBDBM279551((R)-N,3-dimethyl-1-(6-(oxazol-5-yl)-1H-benzo[d]imi...)
Affinity DataIC50:  34nMpH: 7.4 T: 2°C. Assay description: The assays were performed in U-bottom 384-well plates. The final assay volume was 30 μl prepared from 15 μl additions of enzyme and substra...
Ligand InfoPC cidPC sid
In DepthDetails US Patent