BDBM279553 4-methyl-2-(6-(oxazol-5-yl)-1H-benzo[d]imidazol-2-yl)pentan-2-amine::US10035777, Example 103
SMILES CC(C)CC(C)(N)c1nc2ccc(cc2[nH]1)-c1cnco1
InChI Key
Data  1 IC50
  Tab Delimited (TSV)   2D SDfile   Computed 3D by Vconf -m prep SDfile
Find this compound or compounds like it in BindingDB:
Activity Spreadsheet -- Enzyme Inhibition Constant Data from BindingDB
Found 1 hit for monomerid = 279553
TargetAP2-associated protein kinase 1(Homo sapiens (Human))
Bristol-Myers Squibb
US Patent
LigandPNGBDBM279553(4-methyl-2-(6-(oxazol-5-yl)-1H-benzo[d]imidazol-2-...)
Affinity DataIC50:  158nMpH: 7.4 T: 2°C. Assay description: The assays were performed in U-bottom 384-well plates. The final assay volume was 30 μl prepared from 15 μl additions of enzyme and substra...
Ligand InfoPC cidPC sid
In DepthDetails US Patent