BDBM27962 1-((1r,4r)-4-morpholinocyclohexyl)-3-(2-(thiophen-2-ylmethyl)-1H-benzo[d]imidazol-5-yl)-1H-pyrazolo[3,4-d]pyrimidin-4-amine::1-((trans)-4-morpholinocyclohexyl)-3-(2-(thiophen-2-ylmethyl)-1H-benzo[d]imidazol-6-yl)-1H-pyrazolo[3,4-d]pyrimidin-4-amine::1-[4-(morpholin-4-yl)cyclohexyl]-3-[2-(thiophen-2-ylmethyl)-1H-1,3-benzodiazol-6-yl]-1H-pyrazolo[3,4-d]pyrimidin-4-amine::CHEMBL248877::substituted benzimidazole, 7
SMILES Nc1ncnc2n(nc(-c3ccc4nc(Cc5cccs5)[nH]c4c3)c12)[C@H]1CC[C@@H](CC1)N1CCOCC1
InChI Key InChIKey=FNIODIAGYLWZRY-WGSAOQKQSA-N
Data  5 IC50
  Tab Delimited (TSV)   2D SDfile   Computed 3D by Vconf -m prep SDfile
Find this compound or compounds like it in BindingDB:
Activity Spreadsheet -- Enzyme Inhibition Constant Data from BindingDB
Found 5 hits for monomerid = 27962
TargetInsulin-like growth factor 1 receptor(Homo sapiens (Human))
Abbott Laboratories
LigandPNGBDBM27962(1-((1r,4r)-4-morpholinocyclohexyl)-3-(2-(thiophen-...)
Affinity DataIC50:  25nMpH: 7.5 T: 2°C. Assay description: Assays were performed in 96-well microtiter plates in reaction buffer containing biotinylated substrate, ATP, and purified kinase in the presence of ...
In DepthDetails ArticlePubMed
TargetEpidermal growth factor receptor [671-1210,L858R](Homo sapiens (Human))
Abbott Laboratories
LigandPNGBDBM27962(1-((1r,4r)-4-morpholinocyclohexyl)-3-(2-(thiophen-...)
Affinity DataIC50:  361nMpH: 7.5 T: 2°C. Assay description: Assays were performed in 96-well microtiter plates in reaction buffer containing biotinylated substrate, ATP, and purified kinase in the presence of ...
In DepthDetails ArticlePubMed
TargetInsulin-like growth factor 1 receptor(Homo sapiens (Human))
Abbott Laboratories
LigandPNGBDBM27962(1-((1r,4r)-4-morpholinocyclohexyl)-3-(2-(thiophen-...)
Affinity DataIC50:  23nM. Assay description: Inhibition of human IGF1R expressed in Sf21 cells by time-resolved fluorescence assay
In DepthDetails ArticlePubMed
TargetInsulin-like growth factor 1 receptor(Homo sapiens (Human))
Abbott Laboratories
LigandPNGBDBM27962(1-((1r,4r)-4-morpholinocyclohexyl)-3-(2-(thiophen-...)
Affinity DataIC50:  56nM. Assay description: Inhibition IGF1R phosphorylation in human MiaPaCa2 cells
In DepthDetails ArticlePubMed
TargetReceptor tyrosine-protein kinase erbB-2(Homo sapiens (Human))
Abbott Laboratories
LigandPNGBDBM27962(1-((1r,4r)-4-morpholinocyclohexyl)-3-(2-(thiophen-...)
Affinity DataIC50:  250nMpH: 7.5 T: 2°C. Assay description: Assays were performed in 96-well microtiter plates in reaction buffer containing biotinylated substrate, ATP, and purified kinase in the presence of ...
In DepthDetails ArticlePubMed