BDBM279620 5-(5-cyclopropyl-2,4-dihydroxyl-phenyl)-N-ethyl-4-(2-methyl-1,2,3,4-tetrahydroisoquinolin-6-yl)isoxazole-3-carboxamide::US10035792, Example 35
SMILES CCNC(=O)c1noc(c1-c1ccc2CN(C)CCc2c1)-c1cc(C2CC2)c(O)cc1O
InChI Key InChIKey=BKMVOVXQEJTFQI-UHFFFAOYSA-N
Data  1 IC50
  Tab Delimited (TSV)   2D SDfile   Computed 3D by Vconf -m prep SDfile
Find this compound or compounds like it in BindingDB:
Activity Spreadsheet -- Enzyme Inhibition Constant Data from BindingDB
Found 1 hit for monomerid = 279620
TargetHeat shock protein HSP 90-alpha(Homo sapiens (Human))
Chia Tai Tianqing Pharmaceutical Group
US Patent
LigandPNGBDBM279620(5-(5-cyclopropyl-2,4-dihydroxyl-phenyl)-N-ethyl-4-...)
Affinity DataIC50: <20nMpH: 7.4Assay Description:The fluorescent labeled small molecule used in the present invention was VER-00051001 (synthesized by reference to the synthetic method described in ...
Ligand InfoPC cidPC sid
In DepthDetails US Patent