BDBM279790 US10035804, Example 61
SMILES Cc1ccncc1C(=O)N1CC2(C1)CCN(CC2)c1cncc(c1)N1C(=O)c2ccc(Cl)cc2C1(C)C
InChI Key InChIKey=RYHDPSUVWMVPMY-UHFFFAOYSA-N
Data  2 EC50
  Tab Delimited (TSV)   2D SDfile   Computed 3D by Vconf -m prep SDfile
Find this compound or compounds like it in BindingDB:
Activity Spreadsheet -- Enzyme Inhibition Constant Data from BindingDB
Found 2 hits for monomerid = 279790
TargetCytochrome P450 11B1, mitochondrial(Homo sapiens (Human))
Hoffmann-La Roche
US Patent
LigandPNGBDBM279790(US10035804, Example 61)
Affinity DataEC50:  2.11nM. Assay description: Herein we identified the use of the G-402 cell line as a host cell to ectopically express (transiently or stably) enzymes of the CYP11 family. Specif...
Ligand InfoPC cidPC sid
In DepthDetails US Patent
TargetCytochrome P450 11B2, mitochondrial(Homo sapiens (Human))
Hoffmann-La Roche
US Patent
LigandPNGBDBM279790(US10035804, Example 61)
Affinity DataEC50:  0.00200nM. Assay description: Herein we identified the use of the G-402 cell line as a host cell to ectopically express (transiently or stably) enzymes of the CYP11 family. Specif...
Ligand InfoPC cidPC sid
In DepthDetails US Patent