BDBM279795 PM(2)BG::US10035814, Compound 142915
SMILES C[C@H](CCn1cnc2c1nc(N)[nH]c2=O)OCP(O)(=O)OP(O)(=O)OP(O)(O)=O
InChI Key
Data  1 EC50
  Tab Delimited (TSV)   2D SDfile   Computed 3D by Vconf -m prep SDfile
Find this compound or compounds like it in BindingDB:
Activity Spreadsheet -- Enzyme Inhibition Constant Data from BindingDB
Found 1 hit for monomerid = 279795
TargetTelomerase protein component 1(Homo sapiens (Human))
Geron
US Patent
LigandPNGBDBM279795(PM(2)BG | US10035814, Compound 142915)
Affinity DataEC50: >6.00E+4nMpH: 8.5Assay Description:(((Guanine-9-yl) propan-2-oxy) methyl) phosphonic acid diphosphate (PMPGpp) acts as a chain terminator and competes with dGTP.Purified human telomera...
Ligand InfoKEGGPC cidPC sid
In DepthDetails US Patent