BDBM279808 US10035814, Compound 142942::bis-PMPG spermine
SMILES CC(Cn1cnc2c1nc(N)[nH]c2=O)OCP(O)(=O)NCCCNCCCCNCCCNP(O)(=O)COC(C)Cn1cnc2c1nc(N)[nH]c2=O
InChI Key
Data  1 EC50
  Tab Delimited (TSV)   2D SDfile   Computed 3D by Vconf -m prep SDfile
Find this compound or compounds like it in BindingDB:
Activity Spreadsheet -- Enzyme Inhibition Constant Data from BindingDB
Found 1 hit for monomerid = 279808
TargetTelomerase protein component 1(Homo sapiens (Human))
Geron
US Patent
LigandPNGBDBM279808(US10035814, Compound 142942 | bis-PMPG spermine)
Affinity DataEC50:  1.84E+3nM. Assay description: Telomerase inhibition is observed in cells following the addition of the prodrugs (R)-PMPG-diisopropyloxy ester or (S)-PMPG-diisopropyloxy ester. HT3...
Ligand InfoPC cidPC sid
In DepthDetails US Patent