BDBM279977 US10028961, Compound 130::US10172864, Compound 130::US10946023, Compound 130
SMILES CC(Nc1nc(NC(C)C(F)(F)F)nc(n1)-c1cccc(Cl)n1)C(F)(F)F
InChI Key InChIKey=QCZAWDGAVJMPTA-UHFFFAOYSA-N
Data  14 IC50
PDB links: 4 PDB IDs match this monomer.
  Tab Delimited (TSV)   2D SDfile   Computed 3D by Vconf -m prep SDfile
Find this compound or compounds like it in BindingDB:
Activity Spreadsheet -- Enzyme Inhibition Constant Data from BindingDB
Found 14 hits for monomerid = 279977
TargetIsocitrate dehydrogenase [NADP] cytoplasmic [R132H](Homo sapiens (Human))
Agios Pharmaceuticals
US Patent
LigandPNGBDBM279977(US10028961, Compound 130 | US10172864, Compound 13...)
Affinity DataIC50: <50nMpH: 6.5 T: 2°C. Assay description: In the primary reaction, the reduction of α-KG acid to 2-HG is accompanied by a concomitant oxidation of NADPH to NADP. The amount of NADPH rema...
TargetIsocitrate dehydrogenase [NADP] cytoplasmic [R132C](Homo sapiens (Human))
Agios Pharmaceuticals
US Patent
LigandPNGBDBM279977(US10028961, Compound 130 | US10172864, Compound 13...)
Affinity DataIC50: <50nMpH: 6.5 T: 2°C. Assay description: In the primary reaction, the reduction of α-KG acid to 2-HG is accompanied by a concomitant oxidation of NADPH to NADP. The amount of NADPH rema...
TargetIsocitrate dehydrogenase [NADP], mitochondrial [R140Q](Homo sapiens (Human))
Agios Pharmaceuticals
US Patent
LigandPNGBDBM279977(US10028961, Compound 130 | US10172864, Compound 13...)
Affinity DataIC50: <50nMpH: 7.5 T: 2°C. Assay description: Compounds are assayed for IDH2 R140Q inhibitory activity through a cofactor depletion assay. Compounds are preincubated with enzyme, then the reactio...
TargetIsocitrate dehydrogenase [NADP] cytoplasmic [R132H](Homo sapiens (Human))
Agios Pharmaceuticals
US Patent
LigandPNGBDBM279977(US10028961, Compound 130 | US10172864, Compound 13...)
Affinity DataIC50: <50nMpH: 7.5 T: 2°C. Assay description: A test compound is prepared as 10 mM stock in DMSO and diluted to 50× final concentration in DMSO, for a 50 μl reaction mixture. IDH enzyme acti...
TargetIsocitrate dehydrogenase [NADP] cytoplasmic [R132H](Homo sapiens (Human))
Agios Pharmaceuticals
US Patent
LigandPNGBDBM279977(US10028961, Compound 130 | US10172864, Compound 13...)
Affinity DataIC50: <50nM. Assay description: In the primary reaction, the reduction of α-KG acid to 2-HG is accompanied by a concomitant oxidation of NADPH to NADP. The amount of NADPH rema...
TargetIsocitrate dehydrogenase [NADP] cytoplasmic [R132H](Homo sapiens (Human))
Agios Pharmaceuticals
US Patent
LigandPNGBDBM279977(US10028961, Compound 130 | US10172864, Compound 13...)
Affinity DataIC50: <50nM. Assay description: In the primary reaction, the reduction of α-KG acid to 2-HG is accompanied by a concomitant oxidation of NADPH to NADP. The amount of NADPH rema...
TargetIsocitrate dehydrogenase [NADP], mitochondrial [R140Q](Homo sapiens (Human))
Agios Pharmaceuticals
US Patent
LigandPNGBDBM279977(US10028961, Compound 130 | US10172864, Compound 13...)
Affinity DataIC50: <50nM. Assay description: Compounds are assayed for IDH2 R140Q inhibitory activity through a cofactor depletion assay. Compounds are preincubated with enzyme, then the reactio...
TargetIsocitrate dehydrogenase [NADP] cytoplasmic [R132H](Homo sapiens (Human))
Agios Pharmaceuticals
US Patent
LigandPNGBDBM279977(US10028961, Compound 130 | US10172864, Compound 13...)
Affinity DataIC50: <50nM. Assay description: A test compound is prepared as 10 mM stock in DMSO and diluted to 50× final concentration in DMSO, for a 50 μl reaction mixture. IDH enzyme acti...
TargetIsocitrate dehydrogenase [NADP], mitochondrial(Homo sapiens (Human))
Agios Pharmaceuticals
Curated by ChEMBL
LigandPNGBDBM279977(US10028961, Compound 130 | US10172864, Compound 13...)
Affinity DataIC50:  8nM. Assay description: Inhibition of IDH2 R140Q mutant (unknown origin) transfected using lentiviral expression system in human U87MG cells assessed as reduction in 2-HG co...
TargetIsocitrate dehydrogenase [NADP] cytoplasmic(Homo sapiens (Human))
Agios Pharmaceuticals
Curated by ChEMBL
LigandPNGBDBM279977(US10028961, Compound 130 | US10172864, Compound 13...)
Affinity DataIC50:  0.300nM. Assay description: Inhibition of IDH1 R132H mutant in glioma patient-derived human TS603 neurosphere cells assessed as reduction in 2-HG content using alpha-ketoglutara...
TargetIsocitrate dehydrogenase [NADP] cytoplasmic [R132H](Homo sapiens (Human))
Agios Pharmaceuticals
US Patent
LigandPNGBDBM279977(US10028961, Compound 130 | US10172864, Compound 13...)
Affinity DataIC50: <50nM. Assay description: A test compound is prepared as 10 mM stock in DMSO and diluted to 50× final concentration in DMSO, for a 50 μl reaction mixture. IDH enzyme acti...
TargetIsocitrate dehydrogenase [NADP] cytoplasmic [R132H](Homo sapiens (Human))
Agios Pharmaceuticals
US Patent
LigandPNGBDBM279977(US10028961, Compound 130 | US10172864, Compound 13...)
Affinity DataIC50: <50nM. Assay description: In the primary reaction, the reduction of α-KG acid to 2-HG is accompanied by a concomitant oxidation of NADPH to NADP. The amount of NADPH rema...
TargetIsocitrate dehydrogenase [NADP] cytoplasmic [R132C](Homo sapiens (Human))
Agios Pharmaceuticals
US Patent
LigandPNGBDBM279977(US10028961, Compound 130 | US10172864, Compound 13...)
Affinity DataIC50: <50nM. Assay description: In the primary reaction, the reduction of α-KG acid to 2-HG is accompanied by a concomitant oxidation of NADPH to NADP. The amount of NADPH rema...
TargetIsocitrate dehydrogenase [NADP], mitochondrial [R140Q](Homo sapiens (Human))
Agios Pharmaceuticals
US Patent
LigandPNGBDBM279977(US10028961, Compound 130 | US10172864, Compound 13...)
Affinity DataIC50: <50nM. Assay description: Compounds are assayed for IDH2 R140Q inhibitory activity through a cofactor depletion assay. Compounds are preincubated with enzyme, then the reactio...