BDBM279983 US10028961, Compound 136::US10172864, Compound 136::US10946023, Compound 136
SMILES C[C@@H](Nc1nc(N[C@@H](C)C(F)(F)F)nc(n1)-c1cccc(Cl)n1)C(F)(F)F
InChI Key InChIKey=QCZAWDGAVJMPTA-KNVOCYPGSA-N
Data  12 IC50
  Tab Delimited (TSV)   2D SDfile   Computed 3D by Vconf -m prep SDfile
Find this compound or compounds like it in BindingDB:
Activity Spreadsheet -- Enzyme Inhibition Constant Data from BindingDB
Found 12 hits for monomerid = 279983
TargetIsocitrate dehydrogenase [NADP] cytoplasmic [R132H](Homo sapiens (Human))
Agios Pharmaceuticals
US Patent
LigandPNGBDBM279983(US10028961, Compound 136 | US10172864, Compound 13...)
Affinity DataIC50: <50nMpH: 6.5 T: 2°C. Assay description: In the primary reaction, the reduction of α-KG acid to 2-HG is accompanied by a concomitant oxidation of NADPH to NADP. The amount of NADPH rema...
In DepthDetails US Patent
TargetIsocitrate dehydrogenase [NADP] cytoplasmic [R132C](Homo sapiens (Human))
Agios Pharmaceuticals
US Patent
LigandPNGBDBM279983(US10028961, Compound 136 | US10172864, Compound 13...)
Affinity DataIC50: <50nMpH: 6.5 T: 2°C. Assay description: In the primary reaction, the reduction of α-KG acid to 2-HG is accompanied by a concomitant oxidation of NADPH to NADP. The amount of NADPH rema...
In DepthDetails US Patent
TargetIsocitrate dehydrogenase [NADP], mitochondrial [R140Q](Homo sapiens (Human))
Agios Pharmaceuticals
US Patent
LigandPNGBDBM279983(US10028961, Compound 136 | US10172864, Compound 13...)
Affinity DataIC50: <50nMpH: 7.5 T: 2°C. Assay description: Compounds are assayed for IDH2 R140Q inhibitory activity through a cofactor depletion assay. Compounds are preincubated with enzyme, then the reactio...
In DepthDetails US Patent
TargetIsocitrate dehydrogenase [NADP] cytoplasmic [R132H](Homo sapiens (Human))
Agios Pharmaceuticals
US Patent
LigandPNGBDBM279983(US10028961, Compound 136 | US10172864, Compound 13...)
Affinity DataIC50: <50nMpH: 7.5 T: 2°C. Assay description: A test compound is prepared as 10 mM stock in DMSO and diluted to 50× final concentration in DMSO, for a 50 μl reaction mixture. IDH enzyme acti...
In DepthDetails US Patent
TargetIsocitrate dehydrogenase [NADP] cytoplasmic [R132H](Homo sapiens (Human))
Agios Pharmaceuticals
US Patent
LigandPNGBDBM279983(US10028961, Compound 136 | US10172864, Compound 13...)
Affinity DataIC50: <50nM. Assay description: In the primary reaction, the reduction of α-KG acid to 2-HG is accompanied by a concomitant oxidation of NADPH to NADP. The amount of NADPH rema...
In DepthDetails US Patent
TargetIsocitrate dehydrogenase [NADP], mitochondrial [R140Q](Homo sapiens (Human))
Agios Pharmaceuticals
US Patent
LigandPNGBDBM279983(US10028961, Compound 136 | US10172864, Compound 13...)
Affinity DataIC50: <50nM. Assay description: Compounds are assayed for IDH2 R140Q inhibitory activity through a cofactor depletion assay. Compounds are preincubated with enzyme, then the reactio...
In DepthDetails US Patent
TargetIsocitrate dehydrogenase [NADP], mitochondrial [R140Q](Homo sapiens (Human))
Agios Pharmaceuticals
US Patent
LigandPNGBDBM279983(US10028961, Compound 136 | US10172864, Compound 13...)
Affinity DataIC50: <50nM. Assay description: Compounds are assayed for IDH2 R140Q inhibitory activity through a cofactor depletion assay. Compounds are preincubated with enzyme, then the reactio...
In DepthDetails US Patent
TargetIsocitrate dehydrogenase [NADP] cytoplasmic [R132H](Homo sapiens (Human))
Agios Pharmaceuticals
US Patent
LigandPNGBDBM279983(US10028961, Compound 136 | US10172864, Compound 13...)
Affinity DataIC50: <50nM. Assay description: A test compound is prepared as 10 mM stock in DMSO and diluted to 50× final concentration in DMSO, for a 50 μl reaction mixture. IDH enzyme acti...
In DepthDetails US Patent
TargetIsocitrate dehydrogenase [NADP] cytoplasmic [R132H](Homo sapiens (Human))
Agios Pharmaceuticals
US Patent
LigandPNGBDBM279983(US10028961, Compound 136 | US10172864, Compound 13...)
Affinity DataIC50: <50nM. Assay description: A test compound is prepared as 10 mM stock in DMSO and diluted to 50× final concentration in DMSO, for a 50 μl reaction mixture. IDH enzyme acti...
In DepthDetails US Patent
TargetIsocitrate dehydrogenase [NADP] cytoplasmic [R132H](Homo sapiens (Human))
Agios Pharmaceuticals
US Patent
LigandPNGBDBM279983(US10028961, Compound 136 | US10172864, Compound 13...)
Affinity DataIC50: <50nM. Assay description: In the primary reaction, the reduction of α-KG acid to 2-HG is accompanied by a concomitant oxidation of NADPH to NADP. The amount of NADPH rema...
In DepthDetails US Patent
TargetIsocitrate dehydrogenase [NADP] cytoplasmic [R132C](Homo sapiens (Human))
Agios Pharmaceuticals
US Patent
LigandPNGBDBM279983(US10028961, Compound 136 | US10172864, Compound 13...)
Affinity DataIC50: <50nM. Assay description: In the primary reaction, the reduction of α-KG acid to 2-HG is accompanied by a concomitant oxidation of NADPH to NADP. The amount of NADPH rema...
In DepthDetails US Patent
TargetIsocitrate dehydrogenase [NADP] cytoplasmic [R132H](Homo sapiens (Human))
Agios Pharmaceuticals
US Patent
LigandPNGBDBM279983(US10028961, Compound 136 | US10172864, Compound 13...)
Affinity DataIC50: <50nM. Assay description: In the primary reaction, the reduction of α-KG acid to 2-HG is accompanied by a concomitant oxidation of NADPH to NADP. The amount of NADPH rema...
In DepthDetails US Patent