BDBM280021 US10028961, Compound 174::US10172864, Compound 174
SMILES FC(F)(F)c1ccn(n1)-c1nc(N[C@H]2CCC(F)(F)C2)nc(Nc2ccnc(c2)C2(CC2)[N+]#[C-])n1
InChI Key InChIKey=ZSYUHTUAGISLHX-ZDUSSCGKSA-N
Data  8 IC50
  Tab Delimited (TSV)   2D SDfile   Computed 3D by Vconf -m prep SDfile
Find this compound or compounds like it in BindingDB:
Activity Spreadsheet -- Enzyme Inhibition Constant Data from BindingDB
Found 8 hits for monomerid = 280021
TargetIsocitrate dehydrogenase [NADP] cytoplasmic [R132H](Homo sapiens (Human))
Agios Pharmaceuticals
US Patent
LigandPNGBDBM280021(US10028961, Compound 174 | US10172864, Compound 17...)
Affinity DataIC50: <50nMpH: 6.5 T: 2°C. Assay description: In the primary reaction, the reduction of α-KG acid to 2-HG is accompanied by a concomitant oxidation of NADPH to NADP. The amount of NADPH rema...
Ligand InfoPC cidPC sid
In DepthDetails US Patent
TargetIsocitrate dehydrogenase [NADP], mitochondrial [R140Q](Homo sapiens (Human))
Agios Pharmaceuticals
US Patent
LigandPNGBDBM280021(US10028961, Compound 174 | US10172864, Compound 17...)
Affinity DataIC50: <50nMpH: 7.5 T: 2°C. Assay description: Compounds are assayed for IDH2 R140Q inhibitory activity through a cofactor depletion assay. Compounds are preincubated with enzyme, then the reactio...
Ligand InfoPC cidPC sid
In DepthDetails US Patent
TargetIsocitrate dehydrogenase [NADP] cytoplasmic [R132H](Homo sapiens (Human))
Agios Pharmaceuticals
US Patent
LigandPNGBDBM280021(US10028961, Compound 174 | US10172864, Compound 17...)
Affinity DataIC50: <50nMpH: 7.5 T: 2°C. Assay description: A test compound is prepared as 10 mM stock in DMSO and diluted to 50× final concentration in DMSO, for a 50 μl reaction mixture. IDH enzyme acti...
Ligand InfoPC cidPC sid
In DepthDetails US Patent
TargetIsocitrate dehydrogenase [NADP] cytoplasmic [R132C](Homo sapiens (Human))
Agios Pharmaceuticals
US Patent
LigandPNGBDBM280021(US10028961, Compound 174 | US10172864, Compound 17...)
Affinity DataIC50:  75nM. Assay description: A test compound is prepared as 10 mM stock in DMSO and diluted to 50× final concentration in DMSO, for a 50 μl reaction mixture. IDH enzyme acti...
Ligand InfoPC cidPC sid
In DepthDetails US Patent
TargetIsocitrate dehydrogenase [NADP] cytoplasmic [R132H](Homo sapiens (Human))
Agios Pharmaceuticals
US Patent
LigandPNGBDBM280021(US10028961, Compound 174 | US10172864, Compound 17...)
Affinity DataIC50: <50nM. Assay description: In the primary reaction, the reduction of α-KG acid to 2-HG is accompanied by a concomitant oxidation of NADPH to NADP. The amount of NADPH rema...
Ligand InfoPC cidPC sid
In DepthDetails US Patent
TargetIsocitrate dehydrogenase [NADP], mitochondrial [R140Q](Homo sapiens (Human))
Agios Pharmaceuticals
US Patent
LigandPNGBDBM280021(US10028961, Compound 174 | US10172864, Compound 17...)
Affinity DataIC50: <50nM. Assay description: Compounds are assayed for IDH2 R140Q inhibitory activity through a cofactor depletion assay. Compounds are preincubated with enzyme, then the reactio...
Ligand InfoPC cidPC sid
In DepthDetails US Patent
TargetIsocitrate dehydrogenase [NADP] cytoplasmic [R132H](Homo sapiens (Human))
Agios Pharmaceuticals
US Patent
LigandPNGBDBM280021(US10028961, Compound 174 | US10172864, Compound 17...)
Affinity DataIC50: <50nM. Assay description: A test compound is prepared as 10 mM stock in DMSO and diluted to 50× final concentration in DMSO, for a 50 μl reaction mixture. IDH enzyme acti...
Ligand InfoPC cidPC sid
In DepthDetails US Patent
TargetIsocitrate dehydrogenase [NADP] cytoplasmic [R132C](Homo sapiens (Human))
Agios Pharmaceuticals
US Patent
LigandPNGBDBM280021(US10028961, Compound 174 | US10172864, Compound 17...)
Affinity DataIC50:  75nMpH: 7.5 T: 2°C. Assay description: A test compound is prepared as 10 mM stock in DMSO and diluted to 50× final concentration in DMSO, for a 50 μl reaction mixture. IDH enzyme acti...
Ligand InfoPC cidPC sid
In DepthDetails US Patent