BDBM280062 US10028961, Compound 215::US10172864, Compound 215
SMILES FC(F)(F)CNc1nc(Nc2ccnc(c2)C2(CC2)[N+]#[C-])nc(n1)-c1cccc(Cl)n1
InChI Key InChIKey=RJYPNTZBJZUSPV-UHFFFAOYSA-N
Data  6 IC50
  Tab Delimited (TSV)   2D SDfile   Computed 3D by Vconf -m prep SDfile
Find this compound or compounds like it in BindingDB:
Activity Spreadsheet -- Enzyme Inhibition Constant Data from BindingDB
Found 6 hits for monomerid = 280062
TargetIsocitrate dehydrogenase [NADP] cytoplasmic [R132H](Homo sapiens (Human))
Agios Pharmaceuticals
US Patent
LigandPNGBDBM280062(US10028961, Compound 215 | US10172864, Compound 21...)
Affinity DataIC50: <50nMpH: 6.5 T: 2°C. Assay description: In the primary reaction, the reduction of α-KG acid to 2-HG is accompanied by a concomitant oxidation of NADPH to NADP. The amount of NADPH rema...
Ligand InfoPC cidPC sid
In DepthDetails US Patent
TargetIsocitrate dehydrogenase [NADP], mitochondrial [R140Q](Homo sapiens (Human))
Agios Pharmaceuticals
US Patent
LigandPNGBDBM280062(US10028961, Compound 215 | US10172864, Compound 21...)
Affinity DataIC50: <50nMpH: 7.5 T: 2°C. Assay description: Compounds are assayed for IDH2 R140Q inhibitory activity through a cofactor depletion assay. Compounds are preincubated with enzyme, then the reactio...
Ligand InfoPC cidPC sid
In DepthDetails US Patent
TargetIsocitrate dehydrogenase [NADP] cytoplasmic [R132H](Homo sapiens (Human))
Agios Pharmaceuticals
US Patent
LigandPNGBDBM280062(US10028961, Compound 215 | US10172864, Compound 21...)
Affinity DataIC50:  75nM. Assay description: A test compound is prepared as 10 mM stock in DMSO and diluted to 50× final concentration in DMSO, for a 50 μl reaction mixture. IDH enzyme acti...
Ligand InfoPC cidPC sid
In DepthDetails US Patent
TargetIsocitrate dehydrogenase [NADP] cytoplasmic [R132H](Homo sapiens (Human))
Agios Pharmaceuticals
US Patent
LigandPNGBDBM280062(US10028961, Compound 215 | US10172864, Compound 21...)
Affinity DataIC50: <50nM. Assay description: In the primary reaction, the reduction of α-KG acid to 2-HG is accompanied by a concomitant oxidation of NADPH to NADP. The amount of NADPH rema...
Ligand InfoPC cidPC sid
In DepthDetails US Patent
TargetIsocitrate dehydrogenase [NADP], mitochondrial [R140Q](Homo sapiens (Human))
Agios Pharmaceuticals
US Patent
LigandPNGBDBM280062(US10028961, Compound 215 | US10172864, Compound 21...)
Affinity DataIC50: <50nM. Assay description: Compounds are assayed for IDH2 R140Q inhibitory activity through a cofactor depletion assay. Compounds are preincubated with enzyme, then the reactio...
Ligand InfoPC cidPC sid
In DepthDetails US Patent
TargetIsocitrate dehydrogenase [NADP] cytoplasmic [R132H](Homo sapiens (Human))
Agios Pharmaceuticals
US Patent
LigandPNGBDBM280062(US10028961, Compound 215 | US10172864, Compound 21...)
Affinity DataIC50:  75nMpH: 7.5 T: 2°C. Assay description: A test compound is prepared as 10 mM stock in DMSO and diluted to 50× final concentration in DMSO, for a 50 μl reaction mixture. IDH enzyme acti...
Ligand InfoPC cidPC sid
In DepthDetails US Patent