BDBM280199 US10028961, Compound 357::US10946023, Compound 357
SMILES CC(F)(F)c1csc(n1)-c1nc(NC2CCC(F)(F)CC2)nc(NC2CCC(F)(F)CC2)n1
InChI Key InChIKey=SPXMCXYDNWDRAD-UHFFFAOYSA-N
Data  4 IC50
  Tab Delimited (TSV)   2D SDfile   Computed 3D by Vconf -m prep SDfile
Find this compound or compounds like it in BindingDB:
Activity Spreadsheet -- Enzyme Inhibition Constant Data from BindingDB
Found 4 hits for monomerid = 280199
TargetIsocitrate dehydrogenase [NADP] cytoplasmic [R132H](Homo sapiens (Human))
Agios Pharmaceuticals
US Patent
LigandPNGBDBM280199(US10028961, Compound 357 | US10946023, Compound 35...)
Affinity DataIC50:  75nMpH: 6.5 T: 2°C. Assay description: In the primary reaction, the reduction of α-KG acid to 2-HG is accompanied by a concomitant oxidation of NADPH to NADP. The amount of NADPH rema...
Ligand InfoPC cidPC sid
In DepthDetails US Patent
TargetIsocitrate dehydrogenase [NADP], mitochondrial [R140Q](Homo sapiens (Human))
Agios Pharmaceuticals
US Patent
LigandPNGBDBM280199(US10028961, Compound 357 | US10946023, Compound 35...)
Affinity DataIC50: <50nM. Assay description: Compounds are assayed for IDH2 R140Q inhibitory activity through a cofactor depletion assay. Compounds are preincubated with enzyme, then the reactio...
Ligand InfoPC cidPC sid
In DepthDetails US Patent
TargetIsocitrate dehydrogenase [NADP] cytoplasmic [R132H](Homo sapiens (Human))
Agios Pharmaceuticals
US Patent
LigandPNGBDBM280199(US10028961, Compound 357 | US10946023, Compound 35...)
Affinity DataIC50:  75nM. Assay description: In the primary reaction, the reduction of α-KG acid to 2-HG is accompanied by a concomitant oxidation of NADPH to NADP. The amount of NADPH rema...
Ligand InfoPC cidPC sid
In DepthDetails US Patent
TargetIsocitrate dehydrogenase [NADP], mitochondrial [R140Q](Homo sapiens (Human))
Agios Pharmaceuticals
US Patent
LigandPNGBDBM280199(US10028961, Compound 357 | US10946023, Compound 35...)
Affinity DataIC50: <50nMpH: 7.5 T: 2°C. Assay description: Compounds are assayed for IDH2 R140Q inhibitory activity through a cofactor depletion assay. Compounds are preincubated with enzyme, then the reactio...
Ligand InfoPC cidPC sid
In DepthDetails US Patent