BDBM28021 6-{[(3-chlorophenyl)methyl]amino}-N-(2-phenoxyethyl)-2-(3,4,5-trimethoxyphenyl)pyridine-3-carboxamide::trisubstituted pyridine analogue, 18g
SMILES COc1cc(cc(OC)c1OC)-c1nc(NCc2cccc(Cl)c2)ccc1C(=O)NCCOc1ccccc1
InChI Key InChIKey=KPIGZSSKXOZWTD-UHFFFAOYSA-N
Data  1 IC50
  Tab Delimited (TSV)   2D SDfile   Computed 3D by Vconf -m prep SDfile
Find this compound or compounds like it in BindingDB:
Activity Spreadsheet -- Enzyme Inhibition Constant Data from BindingDB
Found 1 hit for monomerid = 28021
TargetExtracellular calcium-sensing receptor(Homo sapiens (Human))
Bristol-Myers Squibb
LigandPNGBDBM28021(6-{[(3-chlorophenyl)methyl]amino}-N-(2-phenoxyethy...)
Affinity DataIC50:  162nM. Assay description: Antagonist activity of test compounds was measured in HEK293 cells stably expressing the human recombinant CaR (HEK-CaR) by determining the ability o...
In DepthDetails ArticlePubMed